{"text_format":"1","workbook":"xlsx","n_sheets":6,"sheets":["Kalender-Laengs","LiesMich","Kalender-Original","Feiertage","Ferienkalender - Feiertage","VBA"],"not_rendered":{"charts":0,"images":4,"macros":1,"external_links":0,"defined_names":2,"comments":0,"pivot_tables":0},"unopened":[],"bounds":{"document_bytes":16777216,"sheet_cells":100000,"rows_first":2000,"rows_last":500,"rows_between":2000,"halvings":0,"cell_chars":16384,"cell_head_chars":4096},"cells_cut":0,"cells_raw":0,"read":"whole","date_system":"1900"}

{"sheet":"Kalender-Laengs","index":0,"n_rows":75,"n_cols":61,"rows_kept":75,"cut":false,"hidden":false,"merged":[[0,1,0,2],[5,16,5,18],[6,1,6,4],[6,6,6,10],[6,12,6,15],[1,1,1,2],[6,43,6,46],[6,48,6,51],[6,53,6,56],[6,58,6,61],[43,1,43,4],[43,6,43,10],[43,12,43,15],[43,17,43,20],[43,22,43,25],[43,27,43,30],[6,17,6,20],[6,22,6,25],[6,27,6,30],[6,33,6,36],[6,38,6,41]]}
[{"$f":"DATE(B1,1,1)","v":"2019-01-01"},2019,null,null,"Zoom 77"]
[{"$f":"IF(AND(DAY(DATE(YEAR(A1),3,))=29,YEAR(A1)<>1900),\"Schaltjahr\",\"kein Schaltjahr\")","v":"kein Schaltjahr"},{"$f":"DATE(B1,MONTH(TODAY()),DAY(TODAY()))","v":"2019-10-25"},null,null,"Zoom 74"]
["Heute:"]
[{"$f":"TODAY()","v":"2019-10-25"}]
[]
[null," ",{"$f":"A3","v":"Heute:"},{"$f":"TEXT(WEEKDAY(E6),\"TTTT\")","v":"Freitag"},{"$f":"A4","v":"2019-10-25"},null,null,null,null,null,null,null,null,null,null,null,{"$f":"B1","v":2019}]
[null,"Januar",null,null,null,null,"Februar",null,null,null,null,null,"März",null,null,null,null,"April",null,null,null,null,"Mai",null,null,null,null,"Juni",null,null,null,null,null,"Juli",null,null,null,null,"August",null,null,null,null,"September",null,null,null,null,"Oktober",null,null,null,null,"November",null,null,null,null,"Dezember"]
[null,{"$f":"A1","v":"2019-01-01"},{"$f":"TEXT(WEEKDAY(B8),\"TTT.\")  &\" , KW \"&WEEKNUM(B8)","v":"Di. , KW 1"},{"$f":"Feiertage!A2","v":"Neujahr"},null,null,{"$f":"B8+31","v":"2019-02-01"},{"$f":"TEXT(WEEKDAY(G8),\"TTT.\")  &\" , KW \"&WEEKNUM(G8)","v":"Fr. , KW 5"},{"$f":"IF(G8=Feiertage!$B$7,\"Altweiberf.\",IF(G8=Feiertage!$B$8,\"Rosenmo.\",\"\"))","v":""},null,null,null,{"$f":"IF(A2=\"Schaltjahr\",G8+29,G8+28)","v":"2019-03-01"},{"$f":"TEXT(WEEKDAY(M8),\"TTT.\")  &\" , KW \"&WEEKNUM(M8)","v":"Fr. , KW 9"},null,null,null,{"$f":"M8+31","v":"2019-04-01"},{"$f":"TEXT(WEEKDAY(R8),\"TTT.\")  &\" , KW \"&WEEKNUM(R8)","v":"Mo. , KW 14"},{"$f":"IF(R8=Feiertage!$B$10,\"Kar-Fr.\",IF(R8=Feiertage!$B$11,\"Oster-Sa.\",IF(R8=Feiertage!$B$12,\"Oster-So.\",IF(R8=Feiertage!$B$13,\"Oster-Mo.\",\"\"))))","v":""},null,null,{"$f":"R8+30","v":"2019-05-01"},{"$f":"TEXT(WEEKDAY(W8),\"TTT.\")  &\" , KW \"&WEEKNUM(W8)","v":"Mi. , KW 18"},{"$f":"Feiertage!A15","v":"Maifeiertag"},null,null,{"$f":"W8+31","v":"2019-06-01"},{"$f":"TEXT(WEEKDAY(AB8),\"TTT.\")  &\" , KW \"&WEEKNUM(AB8)","v":"Sa. , KW 22"},{"$f":"IF(AB8=Feiertage!$B$16,\"Christi HF.\",IF(AB8=Feiertage!$B$17,\"Pfingst-So.\",IF(AB8=Feiertage!$B$18,\"Pfingst-Mo.\",IF(AB8=Feiertage!$B$20,\"Fronl.\",\"\"))))","v":""},null,null,null,{"$f":"AB8+30","v":"2019-07-01"},{"$f":"TEXT(WEEKDAY(AH8),\"TTT.\")  &\" , KW \"&WEEKNUM(AH8)","v":"Mo. , KW 27"},null,null,null,{"$f":"AH8+31","v":"2019-08-01"},{"$f":"TEXT(WEEKDAY(AM8),\"TTT.\")  &\" , KW \"&WEEKNUM(AM8)","v":"Do. , KW 31"},null,null,null,{"$f":"AM8+31","v":"2019-09-01"},{"$f":"TEXT(WEEKDAY(AR8),\"TTT.\")  &\" , KW \"&WEEKNUM(AR8)","v":"So. , KW 36"},null,null,null,{"$f":"AR8+30","v":"2019-10-01"},{"$f":"TEXT(WEEKDAY(AW8),\"TTT.\")  &\" , KW \"&WEEKNUM(AW8)","v":"Di. , KW 40"},null,null,null,{"$f":"AW8+31","v":"2019-11-01"},{"$f":"TEXT(WEEKDAY(BB8),\"TTT.\")  &\" , KW \"&WEEKNUM(BB8)","v":"Fr. , KW 44"},{"$f":"Feiertage!A28","v":"Allerhlg"},null,null,{"$f":"BB8+30","v":"2019-12-01"},{"$f":"TEXT(WEEKDAY(BG8),\"TTT.\")  &\" , KW \"&WEEKNUM(BG8)","v":"So. , KW 49"},{"$f":"IF(BG8=Feiertage!$B$35,\"1. Advent\",IF(BG8=Feiertage!$B$36,\"2. Advent\",IF(BG8=Feiertage!$B$37,\"3. Advent\",IF(BG8=Feiertage!$B$38,\"4. Advent\",\"\"))))","v":"1. Advent"}]
[null,{"$f":"B8+1","v":"2019-01-02"},"Mi. , KW 1",null,null,null,{"$f":"G8+1","v":"2019-02-02"},"Sa. , KW 5",{"$f":"IF(G9=Feiertage!$B$7,\"Altweiberf.\",IF(G9=Feiertage!$B$8,\"Rosenmo.\",\"\"))","v":""},{"$f":"Feiertage!A5","v":"Maria Lichtm. D.Her"},null,null,{"$f":"M8+1","v":"2019-03-02"},"Sa. , KW 9",null,null,null,{"$f":"R8+1","v":"2019-04-02"},"Di. , KW 14",{"$f":"IF(R9=Feiertage!$B$10,\"Kar-Fr.\",IF(R9=Feiertage!$B$11,\"Oster-Sa.\",IF(R9=Feiertage!$B$12,\"Oster-So.\",IF(R9=Feiertage!$B$13,\"Oster-Mo.\",\"\"))))","v":""},null,null,{"$f":"W8+1","v":"2019-05-02"},"Do. , KW 18",{"$f":"IF(W9=Feiertage!$B$16,\"Christi HF.\",IF(W9=Feiertage!$B$17,\"Pfingst-So.\",IF(W9=Feiertage!$B$18,\"Pfingst-Mo.\",IF(W9=Feiertage!$B$20,\"Fronl.\",\"\"))))","v":""},null,null,{"$f":"AB8+1","v":"2019-06-02"},"So. , KW 23",{"$f":"IF(AB9=Feiertage!$B$16,\"Christi HF.\",IF(AB9=Feiertage!$B$17,\"Pfingst-So.\",IF(AB9=Feiertage!$B$18,\"Pfingst-Mo.\",IF(AB9=Feiertage!$B$20,\"Fronl.\",\"\"))))","v":""},null,null,null,{"$f":"AH8+1","v":"2019-07-02"},"Di. , KW 27",null,null,null,{"$f":"AM8+1","v":"2019-08-02"},"Fr. , KW 31",null,null,null,{"$f":"AR8+1","v":"2019-09-02"},"Mo. , KW 36",null,null,null,{"$f":"AW8+1","v":"2019-10-02"},"Mi. , KW 40",null,null,null,{"$f":"BB8+1","v":"2019-11-02"},"Sa. , KW 44",{"$f":"Feiertage!A29","v":"Allerseel."},null,null,{"$f":"BG8+1","v":"2019-12-02"},"Mo. , KW 49",{"$f":"IF(BG9=Feiertage!$B$35,\"1. Advent\",IF(BG9=Feiertage!$B$36,\"2. Advent\",IF(BG9=Feiertage!$B$37,\"3. Advent\",IF(BG9=Feiertage!$B$38,\"4. Advent\",\"\"))))","v":""}]
[null,"2019-01-03","Do. , KW 1",null,null,null,"2019-02-03","So. , KW 6",{"$f":"IF(G10=Feiertage!$B$7,\"Altweiberf.\",IF(G10=Feiertage!$B$8,\"Rosenmo.\",\"\"))","v":""},null,null,null,"2019-03-03","So. , KW 10",{"$f":"IF(M10=Feiertage!$B$10,\"Kar-Fr.\",IF(M10=Feiertage!$B$11,\"Oster-Sa.\",IF(M10=Feiertage!$B$12,\"Oster-So.\",IF(M10=Feiertage!$B$13,\"Oster-Mo.\",\"\"))))","v":""},null,null,"2019-04-03","Mi. , KW 14",{"$f":"IF(R10=Feiertage!$B$10,\"Kar-Fr.\",IF(R10=Feiertage!$B$11,\"Oster-Sa.\",IF(R10=Feiertage!$B$12,\"Oster-So.\",IF(R10=Feiertage!$B$13,\"Oster-Mo.\",\"\"))))","v":""},null,null,"2019-05-03","Fr. , KW 18",{"$f":"IF(W10=Feiertage!$B$16,\"Christi HF.\",IF(W10=Feiertage!$B$17,\"Pfingst-So.\",IF(W10=Feiertage!$B$18,\"Pfingst-Mo.\",IF(W10=Feiertage!$B$20,\"Fronl.\",\"\"))))","v":""},null,null,"2019-06-03","Mo. , KW 23",{"$f":"IF(AB10=Feiertage!$B$16,\"Christi HF.\",IF(AB10=Feiertage!$B$17,\"Pfingst-So.\",IF(AB10=Feiertage!$B$18,\"Pfingst-Mo.\",IF(AB10=Feiertage!$B$20,\"Fronl.\",\"\"))))","v":""},null,null,null,"2019-07-03","Mi. , KW 27",null,null,null,"2019-08-03","Sa. , KW 31",null,null,null,"2019-09-03","Di. , KW 36",null,null,null,"2019-10-03","Do. , KW 40",{"$f":"Feiertage!A25","v":"T. d. Dt. Einh."},null,null,"2019-11-03","So. , KW 45",null,null,null,"2019-12-03","Di. , KW 49",{"$f":"IF(BG10=Feiertage!$B$35,\"1. Advent\",IF(BG10=Feiertage!$B$36,\"2. Advent\",IF(BG10=Feiertage!$B$37,\"3. Advent\",IF(BG10=Feiertage!$B$38,\"4. Advent\",\"\"))))","v":""}]
[null,"2019-01-04","Fr. , KW 1",null,null,null,"2019-02-04","Mo. , KW 6",{"$f":"IF(G11=Feiertage!$B$7,\"Altweiberf.\",IF(G11=Feiertage!$B$8,\"Rosenmo.\",\"\"))","v":""},null,null,null,"2019-03-04","Mo. , KW 10",{"$f":"IF(M11=Feiertage!$B$10,\"Kar-Fr.\",IF(M11=Feiertage!$B$11,\"Oster-Sa.\",IF(M11=Feiertage!$B$12,\"Oster-So.\",IF(M11=Feiertage!$B$13,\"Oster-Mo.\",\"\"))))","v":""},null,null,"2019-04-04","Do. , KW 14",{"$f":"IF(R11=Feiertage!$B$10,\"Kar-Fr.\",IF(R11=Feiertage!$B$11,\"Oster-Sa.\",IF(R11=Feiertage!$B$12,\"Oster-So.\",IF(R11=Feiertage!$B$13,\"Oster-Mo.\",\"\"))))","v":""},null,null,"2019-05-04","Sa. , KW 18",{"$f":"IF(W11=Feiertage!$B$16,\"Christi HF.\",IF(W11=Feiertage!$B$17,\"Pfingst-So.\",IF(W11=Feiertage!$B$18,\"Pfingst-Mo.\",IF(W11=Feiertage!$B$20,\"Fronl.\",\"\"))))","v":""},null,null,"2019-06-04","Di. , KW 23",{"$f":"IF(AB11=Feiertage!$B$16,\"Christi HF.\",IF(AB11=Feiertage!$B$17,\"Pfingst-So.\",IF(AB11=Feiertage!$B$18,\"Pfingst-Mo.\",IF(AB11=Feiertage!$B$20,\"Fronl.\",\"\"))))","v":""},null,null,null,"2019-07-04","Do. , KW 27",null,null,null,"2019-08-04","So. , KW 32",null,null,null,"2019-09-04","Mi. , KW 36",null,null,null,"2019-10-04","Fr. , KW 40",null,null,null,"2019-11-04","Mo. , KW 45",null,null,null,"2019-12-04","Mi. , KW 49",{"$f":"IF(BG11=Feiertage!$B$35,\"1. Advent\",IF(BG11=Feiertage!$B$36,\"2. Advent\",IF(BG11=Feiertage!$B$37,\"3. Advent\",IF(BG11=Feiertage!$B$38,\"4. Advent\",\"\"))))","v":""}]
[null,"2019-01-05","Sa. , KW 1",null,null,null,"2019-02-05","Di. , KW 6",{"$f":"IF(G12=Feiertage!$B$7,\"Altweiberf.\",IF(G12=Feiertage!$B$8,\"Rosenmo.\",\"\"))","v":""},null,null,null,"2019-03-05","Di. , KW 10",{"$f":"IF(M12=Feiertage!$B$10,\"Kar-Fr.\",IF(M12=Feiertage!$B$11,\"Oster-Sa.\",IF(M12=Feiertage!$B$12,\"Oster-So.\",IF(M12=Feiertage!$B$13,\"Oster-Mo.\",\"\"))))","v":""},null,null,"2019-04-05","Fr. , KW 14",{"$f":"IF(R12=Feiertage!$B$10,\"Kar-Fr.\",IF(R12=Feiertage!$B$11,\"Oster-Sa.\",IF(R12=Feiertage!$B$12,\"Oster-So.\",IF(R12=Feiertage!$B$13,\"Oster-Mo.\",\"\"))))","v":""},null,null,"2019-05-05","So. , KW 19",{"$f":"IF(W12=Feiertage!$B$16,\"Christi HF.\",IF(W12=Feiertage!$B$17,\"Pfingst-So.\",IF(W12=Feiertage!$B$18,\"Pfingst-Mo.\",IF(W12=Feiertage!$B$20,\"Fronl.\",\"\"))))","v":""},null,null,"2019-06-05","Mi. , KW 23",{"$f":"IF(AB12=Feiertage!$B$16,\"Christi HF.\",IF(AB12=Feiertage!$B$17,\"Pfingst-So.\",IF(AB12=Feiertage!$B$18,\"Pfingst-Mo.\",IF(AB12=Feiertage!$B$20,\"Fronl.\",\"\"))))","v":""},null,null,null,"2019-07-05","Fr. , KW 27",null,null,null,"2019-08-05","Mo. , KW 32",null,null,null,"2019-09-05","Do. , KW 36",null,null,null,"2019-10-05","Sa. , KW 40",null,null,null,"2019-11-05","Di. , KW 45",null,null,null,"2019-12-05","Do. , KW 49",{"$f":"IF(BG12=Feiertage!$B$35,\"1. Advent\",IF(BG12=Feiertage!$B$36,\"2. Advent\",IF(BG12=Feiertage!$B$37,\"3. Advent\",IF(BG12=Feiertage!$B$38,\"4. Advent\",\"\"))))","v":""}]
[null,"2019-01-06","So. , KW 2",{"$f":"Feiertage!A3","v":"Hl. 3 Könige"},null,null,"2019-02-06","Mi. , KW 6",{"$f":"IF(G13=Feiertage!$B$7,\"Altweiberf.\",IF(G13=Feiertage!$B$8,\"Rosenmo.\",\"\"))","v":""},null,null,null,"2019-03-06","Mi. , KW 10",{"$f":"IF(M13=Feiertage!$B$10,\"Kar-Fr.\",IF(M13=Feiertage!$B$11,\"Oster-Sa.\",IF(M13=Feiertage!$B$12,\"Oster-So.\",IF(M13=Feiertage!$B$13,\"Oster-Mo.\",\"\"))))","v":""},null,null,"2019-04-06","Sa. , KW 14",{"$f":"IF(R13=Feiertage!$B$10,\"Kar-Fr.\",IF(R13=Feiertage!$B$11,\"Oster-Sa.\",IF(R13=Feiertage!$B$12,\"Oster-So.\",IF(R13=Feiertage!$B$13,\"Oster-Mo.\",\"\"))))","v":""},null,null,"2019-05-06","Mo. , KW 19",{"$f":"IF(W13=Feiertage!$B$16,\"Christi HF.\",IF(W13=Feiertage!$B$17,\"Pfingst-So.\",IF(W13=Feiertage!$B$18,\"Pfingst-Mo.\",IF(W13=Feiertage!$B$20,\"Fronl.\",\"\"))))","v":""},null,null,"2019-06-06","Do. , KW 23",{"$f":"IF(AB13=Feiertage!$B$16,\"Christi HF.\",IF(AB13=Feiertage!$B$17,\"Pfingst-So.\",IF(AB13=Feiertage!$B$18,\"Pfingst-Mo.\",IF(AB13=Feiertage!$B$20,\"Fronl.\",\"\"))))","v":""},null,null,null,"2019-07-06","Sa. , KW 27",null,null,null,"2019-08-06","Di. , KW 32",null,null,null,"2019-09-06","Fr. , KW 36",null,null,null,"2019-10-06","So. , KW 41",null,null,null,"2019-11-06","Mi. , KW 45",null,null,null,"2019-12-06","Fr. , KW 49",{"$f":"IF(BG13=Feiertage!$B$35,\"1. Advent\",IF(BG13=Feiertage!$B$36,\"2. Advent\",IF(BG13=Feiertage!$B$37,\"3. Advent\",IF(BG13=Feiertage!$B$38,\"4. Advent\",\"\"))))","v":""}]
[null,"2019-01-07","Mo. , KW 2",null,null,null,"2019-02-07","Do. , KW 6",{"$f":"IF(G14=Feiertage!$B$7,\"Altweiberf.\",IF(G14=Feiertage!$B$8,\"Rosenmo.\",\"\"))","v":""},null,null,null,"2019-03-07","Do. , KW 10",{"$f":"IF(M14=Feiertage!$B$10,\"Kar-Fr.\",IF(M14=Feiertage!$B$11,\"Oster-Sa.\",IF(M14=Feiertage!$B$12,\"Oster-So.\",IF(M14=Feiertage!$B$13,\"Oster-Mo.\",\"\"))))","v":""},null,null,"2019-04-07","So. , KW 15",{"$f":"IF(R14=Feiertage!$B$10,\"Kar-Fr.\",IF(R14=Feiertage!$B$11,\"Oster-Sa.\",IF(R14=Feiertage!$B$12,\"Oster-So.\",IF(R14=Feiertage!$B$13,\"Oster-Mo.\",\"\"))))","v":""},null,null,"2019-05-07","Di. , KW 19",{"$f":"IF(W14=Feiertage!$B$16,\"Christi HF.\",IF(W14=Feiertage!$B$17,\"Pfingst-So.\",IF(W14=Feiertage!$B$18,\"Pfingst-Mo.\",IF(W14=Feiertage!$B$20,\"Fronl.\",\"\"))))","v":""},null,null,"2019-06-07","Fr. , KW 23",{"$f":"IF(AB14=Feiertage!$B$16,\"Christi HF.\",IF(AB14=Feiertage!$B$17,\"Pfingst-So.\",IF(AB14=Feiertage!$B$18,\"Pfingst-Mo.\",IF(AB14=Feiertage!$B$20,\"Fronl.\",\"\"))))","v":""},null,null,null,"2019-07-07","So. , KW 28",null,null,null,"2019-08-07","Mi. , KW 32",null,null,null,"2019-09-07","Sa. , KW 36",null,null,null,"2019-10-07","Mo. , KW 41",null,null,null,"2019-11-07","Do. , KW 45",{"$f":"IF(BB14=Feiertage!$B$31,\"VolkstrT.\",IF(BB14=Feiertage!$B$32,\"Buß-BetT.\",IF(BB14=Feiertage!$B$33,\"Totenso.\",\"\")))","v":""},null,null,"2019-12-07","Sa. , KW 49",{"$f":"IF(BG14=Feiertage!$B$35,\"1. Advent\",IF(BG14=Feiertage!$B$36,\"2. Advent\",IF(BG14=Feiertage!$B$37,\"3. Advent\",IF(BG14=Feiertage!$B$38,\"4. Advent\",\"\"))))","v":""}]
[null,"2019-01-08","Di. , KW 2",null,null,null,"2019-02-08","Fr. , KW 6",{"$f":"IF(G15=Feiertage!$B$7,\"Altweiberf.\",IF(G15=Feiertage!$B$8,\"Rosenmo.\",\"\"))","v":""},null,null,null,"2019-03-08","Fr. , KW 10",{"$f":"IF(M15=Feiertage!$B$10,\"Kar-Fr.\",IF(M15=Feiertage!$B$11,\"Oster-Sa.\",IF(M15=Feiertage!$B$12,\"Oster-So.\",IF(M15=Feiertage!$B$13,\"Oster-Mo.\",\"\"))))","v":""},null,null,"2019-04-08","Mo. , KW 15",{"$f":"IF(R15=Feiertage!$B$10,\"Kar-Fr.\",IF(R15=Feiertage!$B$11,\"Oster-Sa.\",IF(R15=Feiertage!$B$12,\"Oster-So.\",IF(R15=Feiertage!$B$13,\"Oster-Mo.\",\"\"))))","v":""},null,null,"2019-05-08","Mi. , KW 19",{"$f":"IF(W15=Feiertage!$B$16,\"Christi HF.\",IF(W15=Feiertage!$B$17,\"Pfingst-So.\",IF(W15=Feiertage!$B$18,\"Pfingst-Mo.\",IF(W15=Feiertage!$B$20,\"Fronl.\",\"\"))))","v":""},null,null,"2019-06-08","Sa. , KW 23",{"$f":"IF(AB15=Feiertage!$B$16,\"Christi HF.\",IF(AB15=Feiertage!$B$17,\"Pfingst-So.\",IF(AB15=Feiertage!$B$18,\"Pfingst-Mo.\",IF(AB15=Feiertage!$B$20,\"Fronl.\",\"\"))))","v":""},null,null,null,"2019-07-08","Mo. , KW 28",null,null,null,"2019-08-08","Do. , KW 32",null,null,null,"2019-09-08","So. , KW 37",null,null,null,"2019-10-08","Di. , KW 41",null,null,null,"2019-11-08","Fr. , KW 45",{"$f":"IF(BB15=Feiertage!$B$31,\"VolkstrT.\",IF(BB15=Feiertage!$B$32,\"Buß-BetT.\",IF(BB15=Feiertage!$B$33,\"Totenso.\",\"\")))","v":""},null,null,"2019-12-08","So. , KW 50",{"$f":"IF(BG15=Feiertage!$B$35,\"1. Advent\",IF(BG15=Feiertage!$B$36,\"2. Advent\",IF(BG15=Feiertage!$B$37,\"3. Advent\",IF(BG15=Feiertage!$B$38,\"4. Advent\",\"\"))))","v":"2. Advent"}]
[null,"2019-01-09","Mi. , KW 2",null,null,null,"2019-02-09","Sa. , KW 6",{"$f":"IF(G16=Feiertage!$B$7,\"Altweiberf.\",IF(G16=Feiertage!$B$8,\"Rosenmo.\",\"\"))","v":""},null,null,null,"2019-03-09","Sa. , KW 10",{"$f":"IF(M16=Feiertage!$B$10,\"Kar-Fr.\",IF(M16=Feiertage!$B$11,\"Oster-Sa.\",IF(M16=Feiertage!$B$12,\"Oster-So.\",IF(M16=Feiertage!$B$13,\"Oster-Mo.\",\"\"))))","v":""},null,null,"2019-04-09","Di. , KW 15",{"$f":"IF(R16=Feiertage!$B$10,\"Kar-Fr.\",IF(R16=Feiertage!$B$11,\"Oster-Sa.\",IF(R16=Feiertage!$B$12,\"Oster-So.\",IF(R16=Feiertage!$B$13,\"Oster-Mo.\",\"\"))))","v":""},null,null,"2019-05-09","Do. , KW 19",{"$f":"IF(W16=Feiertage!$B$16,\"Christi HF.\",IF(W16=Feiertage!$B$17,\"Pfingst-So.\",IF(W16=Feiertage!$B$18,\"Pfingst-Mo.\",IF(W16=Feiertage!$B$20,\"Fronl.\",\"\"))))","v":""},null,null,"2019-06-09","So. , KW 24",{"$f":"IF(AB16=Feiertage!$B$16,\"Christi HF.\",IF(AB16=Feiertage!$B$17,\"Pfingst-So.\",IF(AB16=Feiertage!$B$18,\"Pfingst-Mo.\",IF(AB16=Feiertage!$B$20,\"Fronl.\",\"\"))))","v":"Pfingst-So."},null,null,null,"2019-07-09","Di. , KW 28",null,null,null,"2019-08-09","Fr. , KW 32",null,null,null,"2019-09-09","Mo. , KW 37",null,null,null,"2019-10-09","Mi. , KW 41",null,null,null,"2019-11-09","Sa. , KW 45",{"$f":"IF(BB16=Feiertage!$B$31,\"VolkstrT.\",IF(BB16=Feiertage!$B$32,\"Buß-BetT.\",IF(BB16=Feiertage!$B$33,\"Totenso.\",\"\")))","v":""},null,null,"2019-12-09","Mo. , KW 50",{"$f":"IF(BG16=Feiertage!$B$35,\"1. Advent\",IF(BG16=Feiertage!$B$36,\"2. Advent\",IF(BG16=Feiertage!$B$37,\"3. Advent\",IF(BG16=Feiertage!$B$38,\"4. Advent\",\"\"))))","v":""}]
[null,"2019-01-10","Do. , KW 2",null,null,null,"2019-02-10","So. , KW 7",{"$f":"IF(G17=Feiertage!$B$7,\"Altweiberf.\",IF(G17=Feiertage!$B$8,\"Rosenmo.\",\"\"))","v":""},null,null,null,"2019-03-10","So. , KW 11",{"$f":"IF(M17=Feiertage!$B$10,\"Kar-Fr.\",IF(M17=Feiertage!$B$11,\"Oster-Sa.\",IF(M17=Feiertage!$B$12,\"Oster-So.\",IF(M17=Feiertage!$B$13,\"Oster-Mo.\",\"\"))))","v":""},null,null,"2019-04-10","Mi. , KW 15",{"$f":"IF(R17=Feiertage!$B$10,\"Kar-Fr.\",IF(R17=Feiertage!$B$11,\"Oster-Sa.\",IF(R17=Feiertage!$B$12,\"Oster-So.\",IF(R17=Feiertage!$B$13,\"Oster-Mo.\",\"\"))))","v":""},null,null,"2019-05-10","Fr. , KW 19",{"$f":"IF(W17=Feiertage!$B$16,\"Christi HF.\",IF(W17=Feiertage!$B$17,\"Pfingst-So.\",IF(W17=Feiertage!$B$18,\"Pfingst-Mo.\",IF(W17=Feiertage!$B$20,\"Fronl.\",\"\"))))","v":""},null,null,"2019-06-10","Mo. , KW 24",{"$f":"IF(AB17=Feiertage!$B$16,\"Christi HF.\",IF(AB17=Feiertage!$B$17,\"Pfingst-So.\",IF(AB17=Feiertage!$B$18,\"Pfingst-Mo.\",IF(AB17=Feiertage!$B$20,\"Fronl.\",\"\"))))","v":"Pfingst-Mo."},null,null,null,"2019-07-10","Mi. , KW 28",null,null,null,"2019-08-10","Sa. , KW 32",null,null,null,"2019-09-10","Di. , KW 37",null,null,null,"2019-10-10","Do. , KW 41",null,null,null,"2019-11-10","So. , KW 46",{"$f":"IF(BB17=Feiertage!$B$31,\"VolkstrT.\",IF(BB17=Feiertage!$B$32,\"Buß-BetT.\",IF(BB17=Feiertage!$B$33,\"Totenso.\",\"\")))","v":""},null,null,"2019-12-10","Di. , KW 50",{"$f":"IF(BG17=Feiertage!$B$35,\"1. Advent\",IF(BG17=Feiertage!$B$36,\"2. Advent\",IF(BG17=Feiertage!$B$37,\"3. Advent\",IF(BG17=Feiertage!$B$38,\"4. Advent\",\"\"))))","v":""}]
[null,"2019-01-11","Fr. , KW 2",null,null,null,"2019-02-11","Mo. , KW 7",{"$f":"IF(G18=Feiertage!$B$7,\"Altweiberf.\",IF(G18=Feiertage!$B$8,\"Rosenmo.\",\"\"))","v":""},null,null,null,"2019-03-11","Mo. , KW 11",{"$f":"IF(M18=Feiertage!$B$10,\"Kar-Fr.\",IF(M18=Feiertage!$B$11,\"Oster-Sa.\",IF(M18=Feiertage!$B$12,\"Oster-So.\",IF(M18=Feiertage!$B$13,\"Oster-Mo.\",\"\"))))","v":""},null,null,"2019-04-11","Do. , KW 15",{"$f":"IF(R18=Feiertage!$B$10,\"Kar-Fr.\",IF(R18=Feiertage!$B$11,\"Oster-Sa.\",IF(R18=Feiertage!$B$12,\"Oster-So.\",IF(R18=Feiertage!$B$13,\"Oster-Mo.\",\"\"))))","v":""},null,null,"2019-05-11","Sa. , KW 19",{"$f":"IF(W18=Feiertage!$B$16,\"Christi HF.\",IF(W18=Feiertage!$B$17,\"Pfingst-So.\",IF(W18=Feiertage!$B$18,\"Pfingst-Mo.\",IF(W18=Feiertage!$B$20,\"Fronl.\",\"\"))))","v":""},null,null,"2019-06-11","Di. , KW 24",{"$f":"IF(AB18=Feiertage!$B$16,\"Christi HF.\",IF(AB18=Feiertage!$B$17,\"Pfingst-So.\",IF(AB18=Feiertage!$B$18,\"Pfingst-Mo.\",IF(AB18=Feiertage!$B$20,\"Fronl.\",\"\"))))","v":""},null,null,null,"2019-07-11","Do. , KW 28",null,null,null,"2019-08-11","So. , KW 33",null,null,null,"2019-09-11","Mi. , KW 37",null,null,null,"2019-10-11","Fr. , KW 41",null,null,null,"2019-11-11","Mo. , KW 46",{"$f":"IF(BB18=Feiertage!$B$31,\"VolkstrT.\",IF(BB18=Feiertage!$B$32,\"Buß-BetT.\",IF(BB18=Feiertage!$B$33,\"Totenso.\",\"\")))","v":""},null,null,"2019-12-11","Mi. , KW 50",{"$f":"IF(BG18=Feiertage!$B$35,\"1. Advent\",IF(BG18=Feiertage!$B$36,\"2. Advent\",IF(BG18=Feiertage!$B$37,\"3. Advent\",IF(BG18=Feiertage!$B$38,\"4. Advent\",\"\"))))","v":""}]
[null,"2019-01-12","Sa. , KW 2",null,null,null,"2019-02-12","Di. , KW 7",{"$f":"IF(G19=Feiertage!$B$7,\"Altweiberf.\",IF(G19=Feiertage!$B$8,\"Rosenmo.\",\"\"))","v":""},null,null,null,"2019-03-12","Di. , KW 11",{"$f":"IF(M19=Feiertage!$B$10,\"Kar-Fr.\",IF(M19=Feiertage!$B$11,\"Oster-Sa.\",IF(M19=Feiertage!$B$12,\"Oster-So.\",IF(M19=Feiertage!$B$13,\"Oster-Mo.\",\"\"))))","v":""},null,null,"2019-04-12","Fr. , KW 15",{"$f":"IF(R19=Feiertage!$B$10,\"Kar-Fr.\",IF(R19=Feiertage!$B$11,\"Oster-Sa.\",IF(R19=Feiertage!$B$12,\"Oster-So.\",IF(R19=Feiertage!$B$13,\"Oster-Mo.\",\"\"))))","v":""},null,null,"2019-05-12","So. , KW 20",{"$f":"IF(W19=Feiertage!$B$16,\"Christi HF.\",IF(W19=Feiertage!$B$17,\"Pfingst-So.\",IF(W19=Feiertage!$B$18,\"Pfingst-Mo.\",IF(W19=Feiertage!$B$20,\"Fronl.\",\"\"))))","v":""},null,null,"2019-06-12","Mi. , KW 24",{"$f":"IF(AB19=Feiertage!$B$16,\"Christi HF.\",IF(AB19=Feiertage!$B$17,\"Pfingst-So.\",IF(AB19=Feiertage!$B$18,\"Pfingst-Mo.\",IF(AB19=Feiertage!$B$20,\"Fronl.\",\"\"))))","v":""},null,null,null,"2019-07-12","Fr. , KW 28",null,null,null,"2019-08-12","Mo. , KW 33",null,null,null,"2019-09-12","Do. , KW 37",null,null,null,"2019-10-12","Sa. , KW 41",null,null,null,"2019-11-12","Di. , KW 46",{"$f":"IF(BB19=Feiertage!$B$31,\"VolkstrT.\",IF(BB19=Feiertage!$B$32,\"Buß-BetT.\",IF(BB19=Feiertage!$B$33,\"Totenso.\",\"\")))","v":""},null,null,"2019-12-12","Do. , KW 50",{"$f":"IF(BG19=Feiertage!$B$35,\"1. Advent\",IF(BG19=Feiertage!$B$36,\"2. Advent\",IF(BG19=Feiertage!$B$37,\"3. Advent\",IF(BG19=Feiertage!$B$38,\"4. Advent\",\"\"))))","v":""}]
[null,"2019-01-13","So. , KW 3",null,null,null,"2019-02-13","Mi. , KW 7",{"$f":"IF(G20=Feiertage!$B$7,\"Altweiberf.\",IF(G20=Feiertage!$B$8,\"Rosenmo.\",\"\"))","v":""},null,null,null,"2019-03-13","Mi. , KW 11",{"$f":"IF(M20=Feiertage!$B$10,\"Kar-Fr.\",IF(M20=Feiertage!$B$11,\"Oster-Sa.\",IF(M20=Feiertage!$B$12,\"Oster-So.\",IF(M20=Feiertage!$B$13,\"Oster-Mo.\",\"\"))))","v":""},null,null,"2019-04-13","Sa. , KW 15",{"$f":"IF(R20=Feiertage!$B$10,\"Kar-Fr.\",IF(R20=Feiertage!$B$11,\"Oster-Sa.\",IF(R20=Feiertage!$B$12,\"Oster-So.\",IF(R20=Feiertage!$B$13,\"Oster-Mo.\",\"\"))))","v":""},null,null,"2019-05-13","Mo. , KW 20",{"$f":"IF(W20=Feiertage!$B$16,\"Christi HF.\",IF(W20=Feiertage!$B$17,\"Pfingst-So.\",IF(W20=Feiertage!$B$18,\"Pfingst-Mo.\",IF(W20=Feiertage!$B$20,\"Fronl.\",\"\"))))","v":""},null,null,"2019-06-13","Do. , KW 24",{"$f":"IF(AB20=Feiertage!$B$16,\"Christi HF.\",IF(AB20=Feiertage!$B$17,\"Pfingst-So.\",IF(AB20=Feiertage!$B$18,\"Pfingst-Mo.\",IF(AB20=Feiertage!$B$20,\"Fronl.\",\"\"))))","v":""},null,null,null,"2019-07-13","Sa. , KW 28",null,null,null,"2019-08-13","Di. , KW 33",null,null,null,"2019-09-13","Fr. , KW 37",null,null,null,"2019-10-13","So. , KW 42",null,null,null,"2019-11-13","Mi. , KW 46",{"$f":"IF(BB20=Feiertage!$B$31,\"VolkstrT.\",IF(BB20=Feiertage!$B$32,\"Buß-BetT.\",IF(BB20=Feiertage!$B$33,\"Totenso.\",\"\")))","v":""},null,null,"2019-12-13","Fr. , KW 50",{"$f":"IF(BG20=Feiertage!$B$35,\"1. Advent\",IF(BG20=Feiertage!$B$36,\"2. Advent\",IF(BG20=Feiertage!$B$37,\"3. Advent\",IF(BG20=Feiertage!$B$38,\"4. Advent\",\"\"))))","v":""}]
[null,"2019-01-14","Mo. , KW 3",null,null,null,"2019-02-14","Do. , KW 7",{"$f":"IF(G21=Feiertage!$B$7,\"Altweiberf.\",IF(G21=Feiertage!$B$8,\"Rosenmo.\",\"\"))","v":""},null,null,null,"2019-03-14","Do. , KW 11",{"$f":"IF(M21=Feiertage!$B$10,\"Kar-Fr.\",IF(M21=Feiertage!$B$11,\"Oster-Sa.\",IF(M21=Feiertage!$B$12,\"Oster-So.\",IF(M21=Feiertage!$B$13,\"Oster-Mo.\",\"\"))))","v":""},null,null,"2019-04-14","So. , KW 16",{"$f":"IF(R21=Feiertage!$B$10,\"Kar-Fr.\",IF(R21=Feiertage!$B$11,\"Oster-Sa.\",IF(R21=Feiertage!$B$12,\"Oster-So.\",IF(R21=Feiertage!$B$13,\"Oster-Mo.\",\"\"))))","v":""},null,null,"2019-05-14","Di. , KW 20",{"$f":"IF(W21=Feiertage!$B$16,\"Christi HF.\",IF(W21=Feiertage!$B$17,\"Pfingst-So.\",IF(W21=Feiertage!$B$18,\"Pfingst-Mo.\",IF(W21=Feiertage!$B$20,\"Fronl.\",\"\"))))","v":""},null,null,"2019-06-14","Fr. , KW 24",{"$f":"IF(AB21=Feiertage!$B$16,\"Christi HF.\",IF(AB21=Feiertage!$B$17,\"Pfingst-So.\",IF(AB21=Feiertage!$B$18,\"Pfingst-Mo.\",IF(AB21=Feiertage!$B$20,\"Fronl.\",\"\"))))","v":""},null,null,null,"2019-07-14","So. , KW 29",null,null,null,"2019-08-14","Mi. , KW 33",null,null,null,"2019-09-14","Sa. , KW 37",null,null,null,"2019-10-14","Mo. , KW 42",null,null,null,"2019-11-14","Do. , KW 46",{"$f":"IF(BB21=Feiertage!$B$31,\"VolkstrT.\",IF(BB21=Feiertage!$B$32,\"Buß-BetT.\",IF(BB21=Feiertage!$B$33,\"Totenso.\",\"\")))","v":""},null,null,"2019-12-14","Sa. , KW 50",{"$f":"IF(BG21=Feiertage!$B$35,\"1. Advent\",IF(BG21=Feiertage!$B$36,\"2. Advent\",IF(BG21=Feiertage!$B$37,\"3. Advent\",IF(BG21=Feiertage!$B$38,\"4. Advent\",\"\"))))","v":""}]
[null,"2019-01-15","Di. , KW 3",null,null,null,"2019-02-15","Fr. , KW 7",{"$f":"IF(G22=Feiertage!$B$7,\"Altweiberf.\",IF(G22=Feiertage!$B$8,\"Rosenmo.\",\"\"))","v":""},null,null,null,"2019-03-15","Fr. , KW 11",{"$f":"IF(M22=Feiertage!$B$10,\"Kar-Fr.\",IF(M22=Feiertage!$B$11,\"Oster-Sa.\",IF(M22=Feiertage!$B$12,\"Oster-So.\",IF(M22=Feiertage!$B$13,\"Oster-Mo.\",\"\"))))","v":""},null,null,"2019-04-15","Mo. , KW 16",{"$f":"IF(R22=Feiertage!$B$10,\"Kar-Fr.\",IF(R22=Feiertage!$B$11,\"Oster-Sa.\",IF(R22=Feiertage!$B$12,\"Oster-So.\",IF(R22=Feiertage!$B$13,\"Oster-Mo.\",\"\"))))","v":""},null,null,"2019-05-15","Mi. , KW 20",{"$f":"IF(W22=Feiertage!$B$16,\"Christi HF.\",IF(W22=Feiertage!$B$17,\"Pfingst-So.\",IF(W22=Feiertage!$B$18,\"Pfingst-Mo.\",IF(W22=Feiertage!$B$20,\"Fronl.\",\"\"))))","v":""},null,null,"2019-06-15","Sa. , KW 24",{"$f":"IF(AB22=Feiertage!$B$16,\"Christi HF.\",IF(AB22=Feiertage!$B$17,\"Pfingst-So.\",IF(AB22=Feiertage!$B$18,\"Pfingst-Mo.\",IF(AB22=Feiertage!$B$20,\"Fronl.\",\"\"))))","v":""},null,null,null,"2019-07-15","Mo. , KW 29",null,null,null,"2019-08-15","Do. , KW 33",{"$f":"Feiertage!A23","v":"Mariä HF."},null,null,"2019-09-15","So. , KW 38",null,null,null,"2019-10-15","Di. , KW 42",null,null,null,"2019-11-15","Fr. , KW 46",{"$f":"IF(BB22=Feiertage!$B$31,\"VolkstrT.\",IF(BB22=Feiertage!$B$32,\"Buß-BetT.\",IF(BB22=Feiertage!$B$33,\"Totenso.\",\"\")))","v":""},null,null,"2019-12-15","So. , KW 51",{"$f":"IF(BG22=Feiertage!$B$35,\"1. Advent\",IF(BG22=Feiertage!$B$36,\"2. Advent\",IF(BG22=Feiertage!$B$37,\"3. Advent\",IF(BG22=Feiertage!$B$38,\"4. Advent\",\"\"))))","v":"3. Advent"}]
[null,"2019-01-16","Mi. , KW 3",null,null,null,"2019-02-16","Sa. , KW 7",{"$f":"IF(G23=Feiertage!$B$7,\"Altweiberf.\",IF(G23=Feiertage!$B$8,\"Rosenmo.\",\"\"))","v":""},null,null,null,"2019-03-16","Sa. , KW 11",{"$f":"IF(M23=Feiertage!$B$10,\"Kar-Fr.\",IF(M23=Feiertage!$B$11,\"Oster-Sa.\",IF(M23=Feiertage!$B$12,\"Oster-So.\",IF(M23=Feiertage!$B$13,\"Oster-Mo.\",\"\"))))","v":""},null,null,"2019-04-16","Di. , KW 16",{"$f":"IF(R23=Feiertage!$B$10,\"Kar-Fr.\",IF(R23=Feiertage!$B$11,\"Oster-Sa.\",IF(R23=Feiertage!$B$12,\"Oster-So.\",IF(R23=Feiertage!$B$13,\"Oster-Mo.\",\"\"))))","v":""},null,null,"2019-05-16","Do. , KW 20",{"$f":"IF(W23=Feiertage!$B$16,\"Christi HF.\",IF(W23=Feiertage!$B$17,\"Pfingst-So.\",IF(W23=Feiertage!$B$18,\"Pfingst-Mo.\",IF(W23=Feiertage!$B$20,\"Fronl.\",\"\"))))","v":""},null,null,"2019-06-16","So. , KW 25",{"$f":"IF(AB23=Feiertage!$B$16,\"Christi HF.\",IF(AB23=Feiertage!$B$17,\"Pfingst-So.\",IF(AB23=Feiertage!$B$18,\"Pfingst-Mo.\",IF(AB23=Feiertage!$B$20,\"Fronl.\",\"\"))))","v":""},null,null,null,"2019-07-16","Di. , KW 29",null,null,null,"2019-08-16","Fr. , KW 33",null,null,null,"2019-09-16","Mo. , KW 38",null,null,null,"2019-10-16","Mi. , KW 42",null,null,null,"2019-11-16","Sa. , KW 46",{"$f":"IF(BB23=Feiertage!$B$31,\"VolkstrT.\",IF(BB23=Feiertage!$B$32,\"Buß-BetT.\",IF(BB23=Feiertage!$B$33,\"Totenso.\",\"\")))","v":""},null,null,"2019-12-16","Mo. , KW 51",{"$f":"IF(BG23=Feiertage!$B$35,\"1. Advent\",IF(BG23=Feiertage!$B$36,\"2. Advent\",IF(BG23=Feiertage!$B$37,\"3. Advent\",IF(BG23=Feiertage!$B$38,\"4. Advent\",\"\"))))","v":""}]
[null,"2019-01-17","Do. , KW 3",null,null,null,"2019-02-17","So. , KW 8",{"$f":"IF(G24=Feiertage!$B$7,\"Altweiberf.\",IF(G24=Feiertage!$B$8,\"Rosenmo.\",\"\"))","v":""},null,null,null,"2019-03-17","So. , KW 12",{"$f":"IF(M24=Feiertage!$B$10,\"Kar-Fr.\",IF(M24=Feiertage!$B$11,\"Oster-Sa.\",IF(M24=Feiertage!$B$12,\"Oster-So.\",IF(M24=Feiertage!$B$13,\"Oster-Mo.\",\"\"))))","v":""},null,null,"2019-04-17","Mi. , KW 16",{"$f":"IF(R24=Feiertage!$B$10,\"Kar-Fr.\",IF(R24=Feiertage!$B$11,\"Oster-Sa.\",IF(R24=Feiertage!$B$12,\"Oster-So.\",IF(R24=Feiertage!$B$13,\"Oster-Mo.\",\"\"))))","v":""},null,null,"2019-05-17","Fr. , KW 20",{"$f":"IF(W24=Feiertage!$B$16,\"Christi HF.\",IF(W24=Feiertage!$B$17,\"Pfingst-So.\",IF(W24=Feiertage!$B$18,\"Pfingst-Mo.\",IF(W24=Feiertage!$B$20,\"Fronl.\",\"\"))))","v":""},null,null,"2019-06-17","Mo. , KW 25",{"$f":"IF(AB24=Feiertage!$B$16,\"Christi HF.\",IF(AB24=Feiertage!$B$17,\"Pfingst-So.\",IF(AB24=Feiertage!$B$18,\"Pfingst-Mo.\",IF(AB24=Feiertage!$B$20,\"Fronl.\",\"\"))))","v":""},null,null,null,"2019-07-17","Mi. , KW 29",null,null,null,"2019-08-17","Sa. , KW 33",null,null,null,"2019-09-17","Di. , KW 38",null,null,null,"2019-10-17","Do. , KW 42",null,null,null,"2019-11-17","So. , KW 47",{"$f":"IF(BB24=Feiertage!$B$31,\"VolkstrT.\",IF(BB24=Feiertage!$B$32,\"Buß-BetT.\",IF(BB24=Feiertage!$B$33,\"Totenso.\",\"\")))","v":"VolkstrT."},null,null,"2019-12-17","Di. , KW 51",{"$f":"IF(BG24=Feiertage!$B$35,\"1. Advent\",IF(BG24=Feiertage!$B$36,\"2. Advent\",IF(BG24=Feiertage!$B$37,\"3. Advent\",IF(BG24=Feiertage!$B$38,\"4. Advent\",\"\"))))","v":""}]
[null,"2019-01-18","Fr. , KW 3",null,null,null,"2019-02-18","Mo. , KW 8",{"$f":"IF(G25=Feiertage!$B$7,\"Altweiberf.\",IF(G25=Feiertage!$B$8,\"Rosenmo.\",\"\"))","v":""},null,null,null,"2019-03-18","Mo. , KW 12",{"$f":"IF(M25=Feiertage!$B$10,\"Kar-Fr.\",IF(M25=Feiertage!$B$11,\"Oster-Sa.\",IF(M25=Feiertage!$B$12,\"Oster-So.\",IF(M25=Feiertage!$B$13,\"Oster-Mo.\",\"\"))))","v":""},null,null,"2019-04-18","Do. , KW 16",{"$f":"IF(R25=Feiertage!$B$10,\"Kar-Fr.\",IF(R25=Feiertage!$B$11,\"Oster-Sa.\",IF(R25=Feiertage!$B$12,\"Oster-So.\",IF(R25=Feiertage!$B$13,\"Oster-Mo.\",\"\"))))","v":""},null,null,"2019-05-18","Sa. , KW 20",{"$f":"IF(W25=Feiertage!$B$16,\"Christi HF.\",IF(W25=Feiertage!$B$17,\"Pfingst-So.\",IF(W25=Feiertage!$B$18,\"Pfingst-Mo.\",IF(W25=Feiertage!$B$20,\"Fronl.\",\"\"))))","v":""},null,null,"2019-06-18","Di. , KW 25",{"$f":"IF(AB25=Feiertage!$B$16,\"Christi HF.\",IF(AB25=Feiertage!$B$17,\"Pfingst-So.\",IF(AB25=Feiertage!$B$18,\"Pfingst-Mo.\",IF(AB25=Feiertage!$B$20,\"Fronl.\",\"\"))))","v":""},null,null,null,"2019-07-18","Do. , KW 29",null,null,null,"2019-08-18","So. , KW 34",null,null,null,"2019-09-18","Mi. , KW 38",null,null,null,"2019-10-18","Fr. , KW 42",null,null,null,"2019-11-18","Mo. , KW 47",{"$f":"IF(BB25=Feiertage!$B$31,\"VolkstrT.\",IF(BB25=Feiertage!$B$32,\"Buß-BetT.\",IF(BB25=Feiertage!$B$33,\"Totenso.\",\"\")))","v":""},null,null,"2019-12-18","Mi. , KW 51",{"$f":"IF(BG25=Feiertage!$B$35,\"1. Advent\",IF(BG25=Feiertage!$B$36,\"2. Advent\",IF(BG25=Feiertage!$B$37,\"3. Advent\",IF(BG25=Feiertage!$B$38,\"4. Advent\",\"\"))))","v":""}]
[null,"2019-01-19","Sa. , KW 3",null,null,null,"2019-02-19","Di. , KW 8",{"$f":"IF(G26=Feiertage!$B$7,\"Altweiberf.\",IF(G26=Feiertage!$B$8,\"Rosenmo.\",\"\"))","v":""},null,null,null,"2019-03-19","Di. , KW 12",{"$f":"IF(M26=Feiertage!$B$10,\"Kar-Fr.\",IF(M26=Feiertage!$B$11,\"Oster-Sa.\",IF(M26=Feiertage!$B$12,\"Oster-So.\",IF(M26=Feiertage!$B$13,\"Oster-Mo.\",\"\"))))","v":""},null,null,"2019-04-19","Fr. , KW 16",{"$f":"IF(R26=Feiertage!$B$10,\"Kar-Fr.\",IF(R26=Feiertage!$B$11,\"Oster-Sa.\",IF(R26=Feiertage!$B$12,\"Oster-So.\",IF(R26=Feiertage!$B$13,\"Oster-Mo.\",\"\"))))","v":"Kar-Fr."},null,null,"2019-05-19","So. , KW 21",{"$f":"IF(W26=Feiertage!$B$16,\"Christi HF.\",IF(W26=Feiertage!$B$17,\"Pfingst-So.\",IF(W26=Feiertage!$B$18,\"Pfingst-Mo.\",IF(W26=Feiertage!$B$20,\"Fronl.\",\"\"))))","v":""},null,null,"2019-06-19","Mi. , KW 25",{"$f":"IF(AB26=Feiertage!$B$16,\"Christi HF.\",IF(AB26=Feiertage!$B$17,\"Pfingst-So.\",IF(AB26=Feiertage!$B$18,\"Pfingst-Mo.\",IF(AB26=Feiertage!$B$20,\"Fronl.\",\"\"))))","v":""},null,null,null,"2019-07-19","Fr. , KW 29",null,null,null,"2019-08-19","Mo. , KW 34",null,null,null,"2019-09-19","Do. , KW 38",null,null,null,"2019-10-19","Sa. , KW 42",null,null,null,"2019-11-19","Di. , KW 47",{"$f":"IF(BB26=Feiertage!$B$31,\"VolkstrT.\",IF(BB26=Feiertage!$B$32,\"Buß-BetT.\",IF(BB26=Feiertage!$B$33,\"Totenso.\",\"\")))","v":""},null,null,"2019-12-19","Do. , KW 51",{"$f":"IF(BG26=Feiertage!$B$35,\"1. Advent\",IF(BG26=Feiertage!$B$36,\"2. Advent\",IF(BG26=Feiertage!$B$37,\"3. Advent\",IF(BG26=Feiertage!$B$38,\"4. Advent\",\"\"))))","v":""}]
[null,"2019-01-20","So. , KW 4",null,null,null,"2019-02-20","Mi. , KW 8",{"$f":"IF(G27=Feiertage!$B$7,\"Altweiberf.\",IF(G27=Feiertage!$B$8,\"Rosenmo.\",\"\"))","v":""},null,null,null,"2019-03-20","Mi. , KW 12",{"$f":"IF(M27=Feiertage!$B$10,\"Kar-Fr.\",IF(M27=Feiertage!$B$11,\"Oster-Sa.\",IF(M27=Feiertage!$B$12,\"Oster-So.\",IF(M27=Feiertage!$B$13,\"Oster-Mo.\",\"\"))))","v":""},null,null,"2019-04-20","Sa. , KW 16",{"$f":"IF(R27=Feiertage!$B$10,\"Kar-Fr.\",IF(R27=Feiertage!$B$11,\"Oster-Sa.\",IF(R27=Feiertage!$B$12,\"Oster-So.\",IF(R27=Feiertage!$B$13,\"Oster-Mo.\",\"\"))))","v":"Oster-Sa."},null,null,"2019-05-20","Mo. , KW 21",{"$f":"IF(W27=Feiertage!$B$16,\"Christi HF.\",IF(W27=Feiertage!$B$17,\"Pfingst-So.\",IF(W27=Feiertage!$B$18,\"Pfingst-Mo.\",IF(W27=Feiertage!$B$20,\"Fronl.\",\"\"))))","v":""},null,null,"2019-06-20","Do. , KW 25",{"$f":"IF(AB27=Feiertage!$B$16,\"Christi HF.\",IF(AB27=Feiertage!$B$17,\"Pfingst-So.\",IF(AB27=Feiertage!$B$18,\"Pfingst-Mo.\",IF(AB27=Feiertage!$B$20,\"Fronl.\",\"\"))))","v":"Fronl."},null,null,null,"2019-07-20","Sa. , KW 29",null,null,null,"2019-08-20","Di. , KW 34",null,null,null,"2019-09-20","Fr. , KW 38",null,null,null,"2019-10-20","So. , KW 43",null,null,null,"2019-11-20","Mi. , KW 47",{"$f":"IF(BB27=Feiertage!$B$31,\"VolkstrT.\",IF(BB27=Feiertage!$B$32,\"Buß-BetT.\",IF(BB27=Feiertage!$B$33,\"Totenso.\",\"\")))","v":"Buß-BetT."},null,null,"2019-12-20","Fr. , KW 51",{"$f":"IF(BG27=Feiertage!$B$35,\"1. Advent\",IF(BG27=Feiertage!$B$36,\"2. Advent\",IF(BG27=Feiertage!$B$37,\"3. Advent\",IF(BG27=Feiertage!$B$38,\"4. Advent\",\"\"))))","v":""}]
[null,"2019-01-21","Mo. , KW 4",null,null,null,"2019-02-21","Do. , KW 8",{"$f":"IF(G28=Feiertage!$B$7,\"Altweiberf.\",IF(G28=Feiertage!$B$8,\"Rosenmo.\",\"\"))","v":""},null,null,null,"2019-03-21","Do. , KW 12",{"$f":"IF(M28=Feiertage!$B$10,\"Kar-Fr.\",IF(M28=Feiertage!$B$11,\"Oster-Sa.\",IF(M28=Feiertage!$B$12,\"Oster-So.\",IF(M28=Feiertage!$B$13,\"Oster-Mo.\",\"\"))))","v":""},null,null,"2019-04-21","So. , KW 17",{"$f":"IF(R28=Feiertage!$B$10,\"Kar-Fr.\",IF(R28=Feiertage!$B$11,\"Oster-Sa.\",IF(R28=Feiertage!$B$12,\"Oster-So.\",IF(R28=Feiertage!$B$13,\"Oster-Mo.\",\"\"))))","v":"Oster-So."},null,null,"2019-05-21","Di. , KW 21",{"$f":"IF(W28=Feiertage!$B$16,\"Christi HF.\",IF(W28=Feiertage!$B$17,\"Pfingst-So.\",IF(W28=Feiertage!$B$18,\"Pfingst-Mo.\",IF(W28=Feiertage!$B$20,\"Fronl.\",\"\"))))","v":""},null,null,"2019-06-21","Fr. , KW 25",{"$f":"IF(AB28=Feiertage!$B$16,\"Christi HF.\",IF(AB28=Feiertage!$B$17,\"Pfingst-So.\",IF(AB28=Feiertage!$B$18,\"Pfingst-Mo.\",IF(AB28=Feiertage!$B$20,\"Fronl.\",\"\"))))","v":""},null,null,null,"2019-07-21","So. , KW 30",null,null,null,"2019-08-21","Mi. , KW 34",null,null,null,"2019-09-21","Sa. , KW 38",null,null,null,"2019-10-21","Mo. , KW 43",null,null,null,"2019-11-21","Do. , KW 47",{"$f":"IF(BB28=Feiertage!$B$31,\"VolkstrT.\",IF(BB28=Feiertage!$B$32,\"Buß-BetT.\",IF(BB28=Feiertage!$B$33,\"Totenso.\",\"\")))","v":""},null,null,"2019-12-21","Sa. , KW 51",{"$f":"IF(BG28=Feiertage!$B$35,\"1. Advent\",IF(BG28=Feiertage!$B$36,\"2. Advent\",IF(BG28=Feiertage!$B$37,\"3. Advent\",IF(BG28=Feiertage!$B$38,\"4. Advent\",\"\"))))","v":""}]
[null,"2019-01-22","Di. , KW 4",null,null,null,"2019-02-22","Fr. , KW 8",{"$f":"IF(G29=Feiertage!$B$7,\"Altweiberf.\",IF(G29=Feiertage!$B$8,\"Rosenmo.\",\"\"))","v":""},null,null,null,"2019-03-22","Fr. , KW 12",{"$f":"IF(M29=Feiertage!$B$10,\"Kar-Fr.\",IF(M29=Feiertage!$B$11,\"Oster-Sa.\",IF(M29=Feiertage!$B$12,\"Oster-So.\",IF(M29=Feiertage!$B$13,\"Oster-Mo.\",\"\"))))","v":""},null,null,"2019-04-22","Mo. , KW 17",{"$f":"IF(R29=Feiertage!$B$10,\"Kar-Fr.\",IF(R29=Feiertage!$B$11,\"Oster-Sa.\",IF(R29=Feiertage!$B$12,\"Oster-So.\",IF(R29=Feiertage!$B$13,\"Oster-Mo.\",\"\"))))","v":"Oster-Mo."},null,null,"2019-05-22","Mi. , KW 21",{"$f":"IF(W29=Feiertage!$B$16,\"Christi HF.\",IF(W29=Feiertage!$B$17,\"Pfingst-So.\",IF(W29=Feiertage!$B$18,\"Pfingst-Mo.\",IF(W29=Feiertage!$B$20,\"Fronl.\",\"\"))))","v":""},null,null,"2019-06-22","Sa. , KW 25",{"$f":"IF(AB29=Feiertage!$B$16,\"Christi HF.\",IF(AB29=Feiertage!$B$17,\"Pfingst-So.\",IF(AB29=Feiertage!$B$18,\"Pfingst-Mo.\",IF(AB29=Feiertage!$B$20,\"Fronl.\",\"\"))))","v":""},null,null,null,"2019-07-22","Mo. , KW 30",null,null,null,"2019-08-22","Do. , KW 34",null,null,null,"2019-09-22","So. , KW 39",null,null,null,"2019-10-22","Di. , KW 43",null,null,null,"2019-11-22","Fr. , KW 47",{"$f":"IF(BB29=Feiertage!$B$31,\"VolkstT.\",IF(BB29=Feiertage!$B$32,\"Buß-BetT\",IF(BB29=Feiertage!$B$33,\"Totenso.\",(IF(BB29=Feiertage!$B$35,\"1. Advent\",\"\")))))","v":""},null,null,"2019-12-22","So. , KW 52",{"$f":"IF(BG29=Feiertage!$B$35,\"1. Advent\",IF(BG29=Feiertage!$B$36,\"2. Advent\",IF(BG29=Feiertage!$B$37,\"3. Advent\",IF(BG29=Feiertage!$B$38,\"4. Advent\",\"\"))))","v":"4. Advent"}]
[null,"2019-01-23","Mi. , KW 4",null,null,null,"2019-02-23","Sa. , KW 8",{"$f":"IF(G30=Feiertage!$B$7,\"Altweiberf.\",IF(G30=Feiertage!$B$8,\"Rosenmo.\",\"\"))","v":""},null,null,null,"2019-03-23","Sa. , KW 12",{"$f":"IF(M30=Feiertage!$B$10,\"Kar-Fr.\",IF(M30=Feiertage!$B$11,\"Oster-Sa.\",IF(M30=Feiertage!$B$12,\"Oster-So.\",IF(M30=Feiertage!$B$13,\"Oster-Mo.\",\"\"))))","v":""},null,null,"2019-04-23","Di. , KW 17",{"$f":"IF(R30=Feiertage!$B$10,\"Kar-Fr.\",IF(R30=Feiertage!$B$11,\"Oster-Sa.\",IF(R30=Feiertage!$B$12,\"Oster-So.\",IF(R30=Feiertage!$B$13,\"Oster-Mo.\",\"\"))))","v":""},null,null,"2019-05-23","Do. , KW 21",{"$f":"IF(W30=Feiertage!$B$16,\"Christi HF.\",IF(W30=Feiertage!$B$17,\"Pfingst-So.\",IF(W30=Feiertage!$B$18,\"Pfingst-Mo.\",IF(W30=Feiertage!$B$20,\"Fronl.\",\"\"))))","v":""},null,null,"2019-06-23","So. , KW 26",{"$f":"IF(AB30=Feiertage!$B$16,\"Christi HF.\",IF(AB30=Feiertage!$B$17,\"Pfingst-So.\",IF(AB30=Feiertage!$B$18,\"Pfingst-Mo.\",IF(AB30=Feiertage!$B$20,\"Fronl.\",\"\"))))","v":""},null,null,null,"2019-07-23","Di. , KW 30",null,null,null,"2019-08-23","Fr. , KW 34",null,null,null,"2019-09-23","Mo. , KW 39",null,null,null,"2019-10-23","Mi. , KW 43",null,null,null,"2019-11-23","Sa. , KW 47",{"$f":"IF(BB30=Feiertage!$B$31,\"VolkstT.\",IF(BB30=Feiertage!$B$32,\"Buß-BetT\",IF(BB30=Feiertage!$B$33,\"Totenso.\",(IF(BB30=Feiertage!$B$35,\"1. Advent\",\"\")))))","v":""},null,null,"2019-12-23","Mo. , KW 52",{"$f":"IF(BG30=Feiertage!$B$35,\"1. Advent\",IF(BG30=Feiertage!$B$36,\"2. Advent\",IF(BG30=Feiertage!$B$37,\"3. Advent\",IF(BG30=Feiertage!$B$38,\"4. Advent\",\"\"))))","v":""}]
[null,"2019-01-24","Do. , KW 4",null,null,null,"2019-02-24","So. , KW 9",{"$f":"IF(G31=Feiertage!$B$7,\"Altweiberf.\",IF(G31=Feiertage!$B$8,\"Rosenmo.\",\"\"))","v":""},null,null,null,"2019-03-24","So. , KW 13",{"$f":"IF(M31=Feiertage!$B$10,\"Kar-Fr.\",IF(M31=Feiertage!$B$11,\"Oster-Sa.\",IF(M31=Feiertage!$B$12,\"Oster-So.\",IF(M31=Feiertage!$B$13,\"Oster-Mo.\",\"\"))))","v":""},null,null,"2019-04-24","Mi. , KW 17",{"$f":"IF(R31=Feiertage!$B$10,\"Kar-Fr.\",IF(R31=Feiertage!$B$11,\"Oster-Sa.\",IF(R31=Feiertage!$B$12,\"Oster-So.\",IF(R31=Feiertage!$B$13,\"Oster-Mo.\",\"\"))))","v":""},null,null,"2019-05-24","Fr. , KW 21",{"$f":"IF(W31=Feiertage!$B$16,\"Christi HF.\",IF(W31=Feiertage!$B$17,\"Pfingst-So.\",IF(W31=Feiertage!$B$18,\"Pfingst-Mo.\",IF(W31=Feiertage!$B$20,\"Fronl.\",\"\"))))","v":""},null,null,"2019-06-24","Mo. , KW 26",null,null,null,null,"2019-07-24","Mi. , KW 30",null,null,null,"2019-08-24","Sa. , KW 34",null,null,null,"2019-09-24","Di. , KW 39",null,null,null,"2019-10-24","Do. , KW 43",null,null,null,"2019-11-24","So. , KW 48",{"$f":"IF(BB31=Feiertage!$B$31,\"VolkstT.\",IF(BB31=Feiertage!$B$32,\"Buß-BetT\",IF(BB31=Feiertage!$B$33,\"Totenso.\",(IF(BB31=Feiertage!$B$35,\"1. Advent\",\"\")))))","v":"Totenso."},null,null,"2019-12-24","Di. , KW 52",{"$f":"IF(AB31=Feiertage!$B$38,\"4.Ad+Hl.A.\",Feiertage!A39)","v":"Hl. Abend"}]
[null,"2019-01-25","Fr. , KW 4",null,null,null,"2019-02-25","Mo. , KW 9",{"$f":"IF(G32=Feiertage!$B$7,\"Altweiberf.\",IF(G32=Feiertage!$B$8,\"Rosenmo.\",\"\"))","v":""},null,null,null,"2019-03-25","Mo. , KW 13",{"$f":"IF(M32=Feiertage!$B$10,\"Kar-Fr.\",IF(M32=Feiertage!$B$11,\"Oster-Sa.\",IF(M32=Feiertage!$B$12,\"Oster-So.\",IF(M32=Feiertage!$B$13,\"Oster-Mo.\",\"\"))))","v":""},null,null,"2019-04-25","Do. , KW 17",{"$f":"IF(R32=Feiertage!$B$10,\"Kar-Fr.\",IF(R32=Feiertage!$B$11,\"Oster-Sa.\",IF(R32=Feiertage!$B$12,\"Oster-So.\",IF(R32=Feiertage!$B$13,\"Oster-Mo.\",\"\"))))","v":""},null,null,"2019-05-25","Sa. , KW 21",{"$f":"IF(W32=Feiertage!$B$16,\"Christi HF.\",IF(W32=Feiertage!$B$17,\"Pfingst-So.\",IF(W32=Feiertage!$B$18,\"Pfingst-Mo.\",IF(W32=Feiertage!$B$20,\"Fronl.\",\"\"))))","v":""},null,null,"2019-06-25","Di. , KW 26",null,null,null,null,"2019-07-25","Do. , KW 30",null,null,null,"2019-08-25","So. , KW 35",null,null,null,"2019-09-25","Mi. , KW 39",null,null,null,"2019-10-25","Fr. , KW 43",null,null,null,"2019-11-25","Mo. , KW 48",{"$f":"IF(BB32=Feiertage!$B$31,\"VolkstT.\",IF(BB32=Feiertage!$B$32,\"Buß-BetT\",IF(BB32=Feiertage!$B$33,\"Totenso.\",(IF(BB32=Feiertage!$B$35,\"1. Advent\",\"\")))))","v":""},null,null,"2019-12-25","Mi. , KW 52",{"$f":"Feiertage!A40","v":"1. Weihn. T."}]
[null,"2019-01-26","Sa. , KW 4",null,null,null,"2019-02-26","Di. , KW 9",{"$f":"IF(G33=Feiertage!$B$7,\"Altweiberf.\",IF(G33=Feiertage!$B$8,\"Rosenmo.\",\"\"))","v":""},null,null,null,"2019-03-26","Di. , KW 13",{"$f":"IF(M33=Feiertage!$B$10,\"Kar-Fr.\",IF(M33=Feiertage!$B$11,\"Oster-Sa.\",IF(M33=Feiertage!$B$12,\"Oster-So.\",IF(M33=Feiertage!$B$13,\"Oster-Mo.\",\"\"))))","v":""},null,null,"2019-04-26","Fr. , KW 17",{"$f":"IF(R33=Feiertage!$B$10,\"Kar-Fr.\",IF(R33=Feiertage!$B$11,\"Oster-Sa.\",IF(R33=Feiertage!$B$12,\"Oster-So.\",IF(R33=Feiertage!$B$13,\"Oster-Mo.\",\"\"))))","v":""},null,null,"2019-05-26","So. , KW 22",{"$f":"IF(W33=Feiertage!$B$16,\"Christi HF.\",IF(W33=Feiertage!$B$17,\"Pfingst-So.\",IF(W33=Feiertage!$B$18,\"Pfingst-Mo.\",IF(W33=Feiertage!$B$20,\"Fronl.\",\"\"))))","v":""},null,null,"2019-06-26","Mi. , KW 26",null,null,null,null,"2019-07-26","Fr. , KW 30",null,null,null,"2019-08-26","Mo. , KW 35",null,null,null,"2019-09-26","Do. , KW 39",null,null,null,"2019-10-26","Sa. , KW 43",null,null,null,"2019-11-26","Di. , KW 48",{"$f":"IF(BB33=Feiertage!$B$31,\"VolkstT.\",IF(BB33=Feiertage!$B$32,\"Buß-BetT\",IF(BB33=Feiertage!$B$33,\"Totenso.\",(IF(BB33=Feiertage!$B$35,\"1. Advent\",\"\")))))","v":""},null,null,"2019-12-26","Do. , KW 52",{"$f":"Feiertage!A41","v":"2. Weihn. T."}]
[null,"2019-01-27","So. , KW 5",null,null,null,"2019-02-27","Mi. , KW 9",{"$f":"IF(G34=Feiertage!$B$7,\"Altweiberf.\",IF(G34=Feiertage!$B$8,\"Rosenmo.\",\"\"))","v":""},null,null,null,"2019-03-27","Mi. , KW 13",{"$f":"IF(M34=Feiertage!$B$10,\"Kar-Fr.\",IF(M34=Feiertage!$B$11,\"Oster-Sa.\",IF(M34=Feiertage!$B$12,\"Oster-So.\",IF(M34=Feiertage!$B$13,\"Oster-Mo.\",\"\"))))","v":""},null,null,"2019-04-27","Sa. , KW 17",{"$f":"IF(R34=Feiertage!$B$10,\"Kar-Fr.\",IF(R34=Feiertage!$B$11,\"Oster-Sa.\",IF(R34=Feiertage!$B$12,\"Oster-So.\",IF(R34=Feiertage!$B$13,\"Oster-Mo.\",\"\"))))","v":""},null,null,"2019-05-27","Mo. , KW 22",{"$f":"IF(W34=Feiertage!$B$16,\"Christi HF.\",IF(W34=Feiertage!$B$17,\"Pfingst-So.\",IF(W34=Feiertage!$B$18,\"Pfingst-Mo.\",IF(W34=Feiertage!$B$20,\"Fronl.\",\"\"))))","v":""},null,null,"2019-06-27","Do. , KW 26",null,null,null,null,"2019-07-27","Sa. , KW 30",null,null,null,"2019-08-27","Di. , KW 35",null,null,null,"2019-09-27","Fr. , KW 39",null,null,null,"2019-10-27","So. , KW 44",null,null,null,"2019-11-27","Mi. , KW 48",{"$f":"IF(BB34=Feiertage!$B$31,\"VolkstT.\",IF(BB34=Feiertage!$B$32,\"Buß-BetT\",IF(BB34=Feiertage!$B$33,\"Totenso.\",(IF(BB34=Feiertage!$B$35,\"1. Advent\",\"\")))))","v":""},null,null,"2019-12-27","Fr. , KW 52"]
[null,"2019-01-28","Mo. , KW 5",null,null,null,"2019-02-28","Do. , KW 9",{"$f":"IF(G35=Feiertage!$B$7,\"Altweiberf.\",IF(G35=Feiertage!$B$8,\"Rosenmo.\",\"\"))","v":"Altweiberf."},null,null,null,"2019-03-28","Do. , KW 13",{"$f":"IF(M35=Feiertage!$B$10,\"Kar-Fr.\",IF(M35=Feiertage!$B$11,\"Oster-Sa.\",IF(M35=Feiertage!$B$12,\"Oster-So.\",IF(M35=Feiertage!$B$13,\"Oster-Mo.\",\"\"))))","v":""},null,null,"2019-04-28","So. , KW 18",{"$f":"IF(R35=Feiertage!$B$10,\"Kar-Fr.\",IF(R35=Feiertage!$B$11,\"Oster-Sa.\",IF(R35=Feiertage!$B$12,\"Oster-So.\",IF(R35=Feiertage!$B$13,\"Oster-Mo.\",\"\"))))","v":""},null,null,"2019-05-28","Di. , KW 22",{"$f":"IF(W35=Feiertage!$B$16,\"Christi HF.\",IF(W35=Feiertage!$B$17,\"Pfingst-So.\",IF(W35=Feiertage!$B$18,\"Pfingst-Mo.\",IF(W35=Feiertage!$B$20,\"Fronl.\",\"\"))))","v":""},null,null,"2019-06-28","Fr. , KW 26",null,null,null,null,"2019-07-28","So. , KW 31",null,null,null,"2019-08-28","Mi. , KW 35",null,null,null,"2019-09-28","Sa. , KW 39",null,null,null,"2019-10-28","Mo. , KW 44",null,null,null,"2019-11-28","Do. , KW 48",{"$f":"IF(BB35=Feiertage!$B$31,\"VolkstT.\",IF(BB35=Feiertage!$B$32,\"Buß-BetT\",IF(BB35=Feiertage!$B$33,\"Totenso.\",(IF(BB35=Feiertage!$B$35,\"1. Advent\",\"\")))))","v":""},null,null,"2019-12-28","Sa. , KW 52"]
[null,"2019-01-29","Di. , KW 5",null,null,null,{"$f":"IF(A2=\"Schaltjahr\",G35+1,\"\")","v":""},{"$f":"IF(G36=\"\",\"\",TEXT(WEEKDAY(G36),\"TTT.\")  &\" , KW \"&WEEKNUM(G36))","v":""},{"$f":"IF(G36=Feiertage!$B$7,\"Altweiberf.\",IF(G36=Feiertage!$B$8,\"Rosenmo.\",\"\"))","v":""},null,null,null,"2019-03-29","Fr. , KW 13",{"$f":"IF(M36=Feiertage!$B$10,\"Kar-Fr.\",IF(M36=Feiertage!$B$11,\"Oster-Sa.\",IF(M36=Feiertage!$B$12,\"Oster-So.\",IF(M36=Feiertage!$B$13,\"Oster-Mo.\",\"\"))))","v":""},null,null,"2019-04-29","Mo. , KW 18",{"$f":"IF(R36=Feiertage!$B$10,\"Kar-Fr.\",IF(R36=Feiertage!$B$11,\"Oster-Sa.\",IF(R36=Feiertage!$B$12,\"Oster-So.\",IF(R36=Feiertage!$B$13,\"Oster-Mo.\",\"\"))))","v":""},null,null,"2019-05-29","Mi. , KW 22",{"$f":"IF(W36=Feiertage!$B$16,\"Christi HF.\",IF(W36=Feiertage!$B$17,\"Pfingst-So.\",IF(W36=Feiertage!$B$18,\"Pfingst-Mo.\",IF(W36=Feiertage!$B$20,\"Fronl.\",\"\"))))","v":""},null,null,"2019-06-29","Sa. , KW 26",null,null,null,null,"2019-07-29","Mo. , KW 31",null,null,null,"2019-08-29","Do. , KW 35",null,null,null,"2019-09-29","So. , KW 40",null,null,null,"2019-10-29","Di. , KW 44",null,null,null,"2019-11-29","Fr. , KW 48",{"$f":"IF(BB36=Feiertage!$B$31,\"VolkstT.\",IF(BB36=Feiertage!$B$32,\"Buß-BetT\",IF(BB36=Feiertage!$B$33,\"Totenso.\",(IF(BB36=Feiertage!$B$35,\"1. Advent\",\"\")))))","v":""},null,null,"2019-12-29","So. , KW 53"]
[null,"2019-01-30","Mi. , KW 5",null,null,null,null,null,{"$f":"IF(G37=Feiertage!$B$7,\"Altweiberf.\",IF(G37=Feiertage!$B$8,\"Rosenmo.\",\"\"))","v":""},null,null,null,"2019-03-30","Sa. , KW 13",{"$f":"IF(M37=Feiertage!$B$10,\"Kar-Fr.\",IF(M37=Feiertage!$B$11,\"Oster-Sa.\",IF(M37=Feiertage!$B$12,\"Oster-So.\",IF(M37=Feiertage!$B$13,\"Oster-Mo.\",\"\"))))","v":""},null,null,"2019-04-30","Di. , KW 18",{"$f":"IF(R37=Feiertage!$B$10,\"Kar-Fr.\",IF(R37=Feiertage!$B$11,\"Oster-Sa.\",IF(R37=Feiertage!$B$12,\"Oster-So.\",IF(R37=Feiertage!$B$13,\"Oster-Mo.\",\"\"))))","v":""},null,null,"2019-05-30","Do. , KW 22",{"$f":"IF(W37=Feiertage!$B$16,\"Christi HF.\",IF(W37=Feiertage!$B$17,\"Pfingst-So.\",IF(W37=Feiertage!$B$18,\"Pfingst-Mo.\",IF(W37=Feiertage!$B$20,\"Fronl.\",\"\"))))","v":"Christi HF."},null,null,"2019-06-30","So. , KW 27",null,null,null,null,"2019-07-30","Di. , KW 31",null,null,null,"2019-08-30","Fr. , KW 35",null,null,null,"2019-09-30","Mo. , KW 40",null,null,null,"2019-10-30","Mi. , KW 44",null,null,null,"2019-11-30","Sa. , KW 48",{"$f":"IF(BB37=Feiertage!$B$31,\"VolkstT.\",IF(BB37=Feiertage!$B$32,\"Buß-BetT\",IF(BB37=Feiertage!$B$33,\"Totenso.\",(IF(BB37=Feiertage!$B$35,\"1. Advent\",\"\")))))","v":""},null,null,"2019-12-30","Mo. , KW 53"]
[null,"2019-01-31","Do. , KW 5",null,null,null,null,null,{"$f":"IF(G38=Feiertage!$B$7,\"Altweiberf.\",IF(G38=Feiertage!$B$8,\"Rosenmo.\",\"\"))","v":""},null,null,null,"2019-03-31","So. , KW 14",{"$f":"IF(M38=Feiertage!$B$10,\"Kar-Fr.\",IF(M38=Feiertage!$B$11,\"Oster-Sa.\",IF(M38=Feiertage!$B$12,\"Oster-So.\",IF(M38=Feiertage!$B$13,\"Oster-Mo.\",\"\"))))","v":""},null,null,null,null,{"$f":"IF(R38=Feiertage!$B$10,\"Kar-Fr.\",IF(R38=Feiertage!$B$11,\"Oster-Sa.\",IF(R38=Feiertage!$B$12,\"Oster-So.\",IF(R38=Feiertage!$B$13,\"Oster-Mo.\",\"\"))))","v":""},null,null,"2019-05-31","Fr. , KW 22",{"$f":"IF(W38=Feiertage!$B$16,\"Christi HF.\",IF(W38=Feiertage!$B$17,\"Pfingst-So.\",IF(W38=Feiertage!$B$18,\"Pfingst-Mo.\",IF(W38=Feiertage!$B$20,\"Fronl.\",\"\"))))","v":""},null,null,null,null,null,null,null,null,"2019-07-31","Mi. , KW 31",null,null,null,"2019-08-31","Sa. , KW 35",null,null,null,null,null,null,null,null,"2019-10-31","Do. , KW 44",{"$f":"Feiertage!A26","v":"ReformT."},null,null,null,null,null,null,null,"2019-12-31","Di. , KW 53",{"$f":"Feiertage!A42","v":"Silvester"}]
[]
[]
[]
[]
[]
[null,"Juli",null,null,null,null,"August",null,null,null,null,null,"September",null,null,null,null,"Oktober",null,null,null,null,"November",null,null,null,null,"Dezember"]
[null,{"$f":"AB8+30","v":"2019-07-01"},{"$f":"TEXT(WEEKDAY(B45),\"TTT.\")  &\" , KW \"&WEEKNUM(B45)","v":"Mo. , KW 27"},null,null,null,{"$f":"B45+31","v":"2019-08-01"},{"$f":"TEXT(WEEKDAY(G45),\"TTT.\")  &\" , KW \"&WEEKNUM(G45)","v":"Do. , KW 31"},null,null,null,null,{"$f":"G45+31","v":"2019-09-01"},{"$f":"TEXT(WEEKDAY(M45),\"TTT.\")  &\" , KW \"&WEEKNUM(M45)","v":"So. , KW 36"},null,null,null,{"$f":"M45+30","v":"2019-10-01"},{"$f":"TEXT(WEEKDAY(R45),\"TTT.\")  &\" , KW \"&WEEKNUM(R45)","v":"Di. , KW 40"},null,null,null,{"$f":"R45+31","v":"2019-11-01"},{"$f":"TEXT(WEEKDAY(W45),\"TTT.\")  &\" , KW \"&WEEKNUM(W45)","v":"Fr. , KW 44"},{"$f":"Feiertage!A28","v":"Allerhlg"},null,null,{"$f":"W45+30","v":"2019-12-01"},{"$f":"TEXT(WEEKDAY(AB45),\"TTT.\")  &\" , KW \"&WEEKNUM(AB45)","v":"So. , KW 49"},{"$f":"IF(AB45=Feiertage!$B$35,\"1. Advent\",IF(AB45=Feiertage!$B$36,\"2. Advent\",IF(AB45=Feiertage!$B$37,\"3. Advent\",IF(AB45=Feiertage!$B$38,\"4. Advent\",\"\"))))","v":"1. Advent"}]
[null,{"$f":"B45+1","v":"2019-07-02"},"Di. , KW 27",null,null,null,{"$f":"G45+1","v":"2019-08-02"},"Fr. , KW 31",null,null,null,null,{"$f":"M45+1","v":"2019-09-02"},"Mo. , KW 36",null,null,null,{"$f":"R45+1","v":"2019-10-02"},"Mi. , KW 40",null,null,null,{"$f":"W45+1","v":"2019-11-02"},"Sa. , KW 44",{"$f":"Feiertage!A29","v":"Allerseel."},null,null,{"$f":"AB45+1","v":"2019-12-02"},"Mo. , KW 49",{"$f":"IF(AB46=Feiertage!$B$35,\"1. Advent\",IF(AB46=Feiertage!$B$36,\"2. Advent\",IF(AB46=Feiertage!$B$37,\"3. Advent\",IF(AB46=Feiertage!$B$38,\"4. Advent\",\"\"))))","v":""}]
[null,"2019-07-03","Mi. , KW 27",null,null,null,"2019-08-03","Sa. , KW 31",null,null,null,null,"2019-09-03","Di. , KW 36",null,null,null,"2019-10-03","Do. , KW 40",{"$f":"Feiertage!A25","v":"T. d. Dt. Einh."},null,null,"2019-11-03","So. , KW 45",null,null,null,"2019-12-03","Di. , KW 49",{"$f":"IF(AB47=Feiertage!$B$35,\"1. Advent\",IF(AB47=Feiertage!$B$36,\"2. Advent\",IF(AB47=Feiertage!$B$37,\"3. Advent\",IF(AB47=Feiertage!$B$38,\"4. Advent\",\"\"))))","v":""}]
[null,"2019-07-04","Do. , KW 27",null,null,null,"2019-08-04","So. , KW 32",null,null,null,null,"2019-09-04","Mi. , KW 36",null,null,null,"2019-10-04","Fr. , KW 40",null,null,null,"2019-11-04","Mo. , KW 45",null,null,null,"2019-12-04","Mi. , KW 49",{"$f":"IF(AB48=Feiertage!$B$35,\"1. Advent\",IF(AB48=Feiertage!$B$36,\"2. Advent\",IF(AB48=Feiertage!$B$37,\"3. Advent\",IF(AB48=Feiertage!$B$38,\"4. Advent\",\"\"))))","v":""}]
[null,"2019-07-05","Fr. , KW 27",null,null,null,"2019-08-05","Mo. , KW 32",null,null,null,null,"2019-09-05","Do. , KW 36",null,null,null,"2019-10-05","Sa. , KW 40",null,null,null,"2019-11-05","Di. , KW 45",null,null,null,"2019-12-05","Do. , KW 49",{"$f":"IF(AB49=Feiertage!$B$35,\"1. Advent\",IF(AB49=Feiertage!$B$36,\"2. Advent\",IF(AB49=Feiertage!$B$37,\"3. Advent\",IF(AB49=Feiertage!$B$38,\"4. Advent\",\"\"))))","v":""}]
[null,"2019-07-06","Sa. , KW 27",null,null,null,"2019-08-06","Di. , KW 32",null,null,null,null,"2019-09-06","Fr. , KW 36",null,null,null,"2019-10-06","So. , KW 41",null,null,null,"2019-11-06","Mi. , KW 45",null,null,null,"2019-12-06","Fr. , KW 49",{"$f":"IF(AB50=Feiertage!$B$35,\"1. Advent\",IF(AB50=Feiertage!$B$36,\"2. Advent\",IF(AB50=Feiertage!$B$37,\"3. Advent\",IF(AB50=Feiertage!$B$38,\"4. Advent\",\"\"))))","v":""}]
[null,"2019-07-07","So. , KW 28",null,null,null,"2019-08-07","Mi. , KW 32",null,null,null,null,"2019-09-07","Sa. , KW 36",null,null,null,"2019-10-07","Mo. , KW 41",null,null,null,"2019-11-07","Do. , KW 45",{"$f":"IF(W51=Feiertage!$B$31,\"VolkstrT.\",IF(W51=Feiertage!$B$32,\"Buß-BetT.\",IF(W51=Feiertage!$B$33,\"Totenso.\",\"\")))","v":""},null,null,"2019-12-07","Sa. , KW 49",{"$f":"IF(AB51=Feiertage!$B$35,\"1. Advent\",IF(AB51=Feiertage!$B$36,\"2. Advent\",IF(AB51=Feiertage!$B$37,\"3. Advent\",IF(AB51=Feiertage!$B$38,\"4. Advent\",\"\"))))","v":""}]
[null,"2019-07-08","Mo. , KW 28",null,null,null,"2019-08-08","Do. , KW 32",null,null,null,null,"2019-09-08","So. , KW 37",null,null,null,"2019-10-08","Di. , KW 41",null,null,null,"2019-11-08","Fr. , KW 45",{"$f":"IF(W52=Feiertage!$B$31,\"VolkstrT.\",IF(W52=Feiertage!$B$32,\"Buß-BetT.\",IF(W52=Feiertage!$B$33,\"Totenso.\",\"\")))","v":""},null,null,"2019-12-08","So. , KW 50",{"$f":"IF(AB52=Feiertage!$B$35,\"1. Advent\",IF(AB52=Feiertage!$B$36,\"2. Advent\",IF(AB52=Feiertage!$B$37,\"3. Advent\",IF(AB52=Feiertage!$B$38,\"4. Advent\",\"\"))))","v":"2. Advent"}]
[null,"2019-07-09","Di. , KW 28",null,null,null,"2019-08-09","Fr. , KW 32",null,null,null,null,"2019-09-09","Mo. , KW 37",null,null,null,"2019-10-09","Mi. , KW 41",null,null,null,"2019-11-09","Sa. , KW 45",{"$f":"IF(W53=Feiertage!$B$31,\"VolkstrT.\",IF(W53=Feiertage!$B$32,\"Buß-BetT.\",IF(W53=Feiertage!$B$33,\"Totenso.\",\"\")))","v":""},null,null,"2019-12-09","Mo. , KW 50",{"$f":"IF(AB53=Feiertage!$B$35,\"1. Advent\",IF(AB53=Feiertage!$B$36,\"2. Advent\",IF(AB53=Feiertage!$B$37,\"3. Advent\",IF(AB53=Feiertage!$B$38,\"4. Advent\",\"\"))))","v":""}]
[null,"2019-07-10","Mi. , KW 28",null,null,null,"2019-08-10","Sa. , KW 32",null,null,null,null,"2019-09-10","Di. , KW 37",null,null,null,"2019-10-10","Do. , KW 41",null,null,null,"2019-11-10","So. , KW 46",{"$f":"IF(W54=Feiertage!$B$31,\"VolkstrT.\",IF(W54=Feiertage!$B$32,\"Buß-BetT.\",IF(W54=Feiertage!$B$33,\"Totenso.\",\"\")))","v":""},null,null,"2019-12-10","Di. , KW 50",{"$f":"IF(AB54=Feiertage!$B$35,\"1. Advent\",IF(AB54=Feiertage!$B$36,\"2. Advent\",IF(AB54=Feiertage!$B$37,\"3. Advent\",IF(AB54=Feiertage!$B$38,\"4. Advent\",\"\"))))","v":""}]
[null,"2019-07-11","Do. , KW 28",null,null,null,"2019-08-11","So. , KW 33",null,null,null,null,"2019-09-11","Mi. , KW 37",null,null,null,"2019-10-11","Fr. , KW 41",null,null,null,"2019-11-11","Mo. , KW 46",{"$f":"IF(W55=Feiertage!$B$31,\"VolkstrT.\",IF(W55=Feiertage!$B$32,\"Buß-BetT.\",IF(W55=Feiertage!$B$33,\"Totenso.\",\"\")))","v":""},null,null,"2019-12-11","Mi. , KW 50",{"$f":"IF(AB55=Feiertage!$B$35,\"1. Advent\",IF(AB55=Feiertage!$B$36,\"2. Advent\",IF(AB55=Feiertage!$B$37,\"3. Advent\",IF(AB55=Feiertage!$B$38,\"4. Advent\",\"\"))))","v":""}]
[null,"2019-07-12","Fr. , KW 28",null,null,null,"2019-08-12","Mo. , KW 33",null,null,null,null,"2019-09-12","Do. , KW 37",null,null,null,"2019-10-12","Sa. , KW 41",null,null,null,"2019-11-12","Di. , KW 46",{"$f":"IF(W56=Feiertage!$B$31,\"VolkstrT.\",IF(W56=Feiertage!$B$32,\"Buß-BetT.\",IF(W56=Feiertage!$B$33,\"Totenso.\",\"\")))","v":""},null,null,"2019-12-12","Do. , KW 50",{"$f":"IF(AB56=Feiertage!$B$35,\"1. Advent\",IF(AB56=Feiertage!$B$36,\"2. Advent\",IF(AB56=Feiertage!$B$37,\"3. Advent\",IF(AB56=Feiertage!$B$38,\"4. Advent\",\"\"))))","v":""}]
[null,"2019-07-13","Sa. , KW 28",null,null,null,"2019-08-13","Di. , KW 33",null,null,null,null,"2019-09-13","Fr. , KW 37",null,null,null,"2019-10-13","So. , KW 42",null,null,null,"2019-11-13","Mi. , KW 46",{"$f":"IF(W57=Feiertage!$B$31,\"VolkstrT.\",IF(W57=Feiertage!$B$32,\"Buß-BetT.\",IF(W57=Feiertage!$B$33,\"Totenso.\",\"\")))","v":""},null,null,"2019-12-13","Fr. , KW 50",{"$f":"IF(AB57=Feiertage!$B$35,\"1. Advent\",IF(AB57=Feiertage!$B$36,\"2. Advent\",IF(AB57=Feiertage!$B$37,\"3. Advent\",IF(AB57=Feiertage!$B$38,\"4. Advent\",\"\"))))","v":""}]
[null,"2019-07-14","So. , KW 29",null,null,null,"2019-08-14","Mi. , KW 33",null,null,null,null,"2019-09-14","Sa. , KW 37",null,null,null,"2019-10-14","Mo. , KW 42",null,null,null,"2019-11-14","Do. , KW 46",{"$f":"IF(W58=Feiertage!$B$31,\"VolkstrT.\",IF(W58=Feiertage!$B$32,\"Buß-BetT.\",IF(W58=Feiertage!$B$33,\"Totenso.\",\"\")))","v":""},null,null,"2019-12-14","Sa. , KW 50",{"$f":"IF(AB58=Feiertage!$B$35,\"1. Advent\",IF(AB58=Feiertage!$B$36,\"2. Advent\",IF(AB58=Feiertage!$B$37,\"3. Advent\",IF(AB58=Feiertage!$B$38,\"4. Advent\",\"\"))))","v":""}]
[null,"2019-07-15","Mo. , KW 29",null,null,null,"2019-08-15","Do. , KW 33",{"$f":"Feiertage!A23","v":"Mariä HF."},null,null,null,"2019-09-15","So. , KW 38",null,null,null,"2019-10-15","Di. , KW 42",null,null,null,"2019-11-15","Fr. , KW 46",{"$f":"IF(W59=Feiertage!$B$31,\"VolkstrT.\",IF(W59=Feiertage!$B$32,\"Buß-BetT.\",IF(W59=Feiertage!$B$33,\"Totenso.\",\"\")))","v":""},null,null,"2019-12-15","So. , KW 51",{"$f":"IF(AB59=Feiertage!$B$35,\"1. Advent\",IF(AB59=Feiertage!$B$36,\"2. Advent\",IF(AB59=Feiertage!$B$37,\"3. Advent\",IF(AB59=Feiertage!$B$38,\"4. Advent\",\"\"))))","v":"3. Advent"}]
[null,"2019-07-16","Di. , KW 29",null,null,null,"2019-08-16","Fr. , KW 33",null,null,null,null,"2019-09-16","Mo. , KW 38",null,null,null,"2019-10-16","Mi. , KW 42",null,null,null,"2019-11-16","Sa. , KW 46",{"$f":"IF(W60=Feiertage!$B$31,\"VolkstrT.\",IF(W60=Feiertage!$B$32,\"Buß-BetT.\",IF(W60=Feiertage!$B$33,\"Totenso.\",\"\")))","v":""},null,null,"2019-12-16","Mo. , KW 51",{"$f":"IF(AB60=Feiertage!$B$35,\"1. Advent\",IF(AB60=Feiertage!$B$36,\"2. Advent\",IF(AB60=Feiertage!$B$37,\"3. Advent\",IF(AB60=Feiertage!$B$38,\"4. Advent\",\"\"))))","v":""}]
[null,"2019-07-17","Mi. , KW 29",null,null,null,"2019-08-17","Sa. , KW 33",null,null,null,null,"2019-09-17","Di. , KW 38",null,null,null,"2019-10-17","Do. , KW 42",null,null,null,"2019-11-17","So. , KW 47",{"$f":"IF(W61=Feiertage!$B$31,\"VolkstrT.\",IF(W61=Feiertage!$B$32,\"Buß-BetT.\",IF(W61=Feiertage!$B$33,\"Totenso.\",\"\")))","v":"VolkstrT."},null,null,"2019-12-17","Di. , KW 51",{"$f":"IF(AB61=Feiertage!$B$35,\"1. Advent\",IF(AB61=Feiertage!$B$36,\"2. Advent\",IF(AB61=Feiertage!$B$37,\"3. Advent\",IF(AB61=Feiertage!$B$38,\"4. Advent\",\"\"))))","v":""}]
[null,"2019-07-18","Do. , KW 29",null,null,null,"2019-08-18","So. , KW 34",null,null,null,null,"2019-09-18","Mi. , KW 38",null,null,null,"2019-10-18","Fr. , KW 42",null,null,null,"2019-11-18","Mo. , KW 47",{"$f":"IF(W62=Feiertage!$B$31,\"VolkstrT.\",IF(W62=Feiertage!$B$32,\"Buß-BetT.\",IF(W62=Feiertage!$B$33,\"Totenso.\",\"\")))","v":""},null,null,"2019-12-18","Mi. , KW 51",{"$f":"IF(AB62=Feiertage!$B$35,\"1. Advent\",IF(AB62=Feiertage!$B$36,\"2. Advent\",IF(AB62=Feiertage!$B$37,\"3. Advent\",IF(AB62=Feiertage!$B$38,\"4. Advent\",\"\"))))","v":""}]
[null,"2019-07-19","Fr. , KW 29",null,null,null,"2019-08-19","Mo. , KW 34",null,null,null,null,"2019-09-19","Do. , KW 38",null,null,null,"2019-10-19","Sa. , KW 42",null,null,null,"2019-11-19","Di. , KW 47",{"$f":"IF(W63=Feiertage!$B$31,\"VolkstrT.\",IF(W63=Feiertage!$B$32,\"Buß-BetT.\",IF(W63=Feiertage!$B$33,\"Totenso.\",\"\")))","v":""},null,null,"2019-12-19","Do. , KW 51",{"$f":"IF(AB63=Feiertage!$B$35,\"1. Advent\",IF(AB63=Feiertage!$B$36,\"2. Advent\",IF(AB63=Feiertage!$B$37,\"3. Advent\",IF(AB63=Feiertage!$B$38,\"4. Advent\",\"\"))))","v":""}]
[null,"2019-07-20","Sa. , KW 29",null,null,null,"2019-08-20","Di. , KW 34",null,null,null,null,"2019-09-20","Fr. , KW 38",null,null,null,"2019-10-20","So. , KW 43",null,null,null,"2019-11-20","Mi. , KW 47",{"$f":"IF(W64=Feiertage!$B$31,\"VolkstrT.\",IF(W64=Feiertage!$B$32,\"Buß-BetT.\",IF(W64=Feiertage!$B$33,\"Totenso.\",\"\")))","v":"Buß-BetT."},null,null,"2019-12-20","Fr. , KW 51",{"$f":"IF(AB64=Feiertage!$B$35,\"1. Advent\",IF(AB64=Feiertage!$B$36,\"2. Advent\",IF(AB64=Feiertage!$B$37,\"3. Advent\",IF(AB64=Feiertage!$B$38,\"4. Advent\",\"\"))))","v":""}]
[null,"2019-07-21","So. , KW 30",null,null,null,"2019-08-21","Mi. , KW 34",null,null,null,null,"2019-09-21","Sa. , KW 38",null,null,null,"2019-10-21","Mo. , KW 43",null,null,null,"2019-11-21","Do. , KW 47",{"$f":"IF(W65=Feiertage!$B$31,\"VolkstrT.\",IF(W65=Feiertage!$B$32,\"Buß-BetT.\",IF(W65=Feiertage!$B$33,\"Totenso.\",\"\")))","v":""},null,null,"2019-12-21","Sa. , KW 51",{"$f":"IF(AB65=Feiertage!$B$35,\"1. Advent\",IF(AB65=Feiertage!$B$36,\"2. Advent\",IF(AB65=Feiertage!$B$37,\"3. Advent\",IF(AB65=Feiertage!$B$38,\"4. Advent\",\"\"))))","v":""}]
[null,"2019-07-22","Mo. , KW 30",null,null,null,"2019-08-22","Do. , KW 34",null,null,null,null,"2019-09-22","So. , KW 39",null,null,null,"2019-10-22","Di. , KW 43",null,null,null,"2019-11-22","Fr. , KW 47",{"$f":"IF(W66=Feiertage!$B$31,\"VolkstT.\",IF(W66=Feiertage!$B$32,\"Buß-BetT\",IF(W66=Feiertage!$B$33,\"Totenso.\",(IF(W66=Feiertage!$B$35,\"1. Advent\",\"\")))))","v":""},null,null,"2019-12-22","So. , KW 52",{"$f":"IF(AB66=Feiertage!$B$35,\"1. Advent\",IF(AB66=Feiertage!$B$36,\"2. Advent\",IF(AB66=Feiertage!$B$37,\"3. Advent\",IF(AB66=Feiertage!$B$38,\"4. Advent\",\"\"))))","v":"4. Advent"}]
[null,"2019-07-23","Di. , KW 30",null,null,null,"2019-08-23","Fr. , KW 34",null,null,null,null,"2019-09-23","Mo. , KW 39",null,null,null,"2019-10-23","Mi. , KW 43",null,null,null,"2019-11-23","Sa. , KW 47",{"$f":"IF(W67=Feiertage!$B$31,\"VolkstT.\",IF(W67=Feiertage!$B$32,\"Buß-BetT\",IF(W67=Feiertage!$B$33,\"Totenso.\",(IF(W67=Feiertage!$B$35,\"1. Advent\",\"\")))))","v":""},null,null,"2019-12-23","Mo. , KW 52",{"$f":"IF(AB67=Feiertage!$B$35,\"1. Advent\",IF(AB67=Feiertage!$B$36,\"2. Advent\",IF(AB67=Feiertage!$B$37,\"3. Advent\",IF(AB67=Feiertage!$B$38,\"4. Advent\",\"\"))))","v":""}]
[null,"2019-07-24","Mi. , KW 30",null,null,null,"2019-08-24","Sa. , KW 34",null,null,null,null,"2019-09-24","Di. , KW 39",null,null,null,"2019-10-24","Do. , KW 43",null,null,null,"2019-11-24","So. , KW 48",{"$f":"IF(W68=Feiertage!$B$31,\"VolkstT.\",IF(W68=Feiertage!$B$32,\"Buß-BetT\",IF(W68=Feiertage!$B$33,\"Totenso.\",(IF(W68=Feiertage!$B$35,\"1. Advent\",\"\")))))","v":"Totenso."},null,null,"2019-12-24","Di. , KW 52",{"$f":"IF(AB68=Feiertage!$B$38,\"4.Ad+Hl.A.\",Feiertage!A39)","v":"Hl. Abend"}]
[null,"2019-07-25","Do. , KW 30",null,null,null,"2019-08-25","So. , KW 35",null,null,null,null,"2019-09-25","Mi. , KW 39",null,null,null,"2019-10-25","Fr. , KW 43",null,null,null,"2019-11-25","Mo. , KW 48",{"$f":"IF(W69=Feiertage!$B$31,\"VolkstT.\",IF(W69=Feiertage!$B$32,\"Buß-BetT\",IF(W69=Feiertage!$B$33,\"Totenso.\",(IF(W69=Feiertage!$B$35,\"1. Advent\",\"\")))))","v":""},null,null,"2019-12-25","Mi. , KW 52",{"$f":"Feiertage!A40","v":"1. Weihn. T."}]
[null,"2019-07-26","Fr. , KW 30",null,null,null,"2019-08-26","Mo. , KW 35",null,null,null,null,"2019-09-26","Do. , KW 39",null,null,null,"2019-10-26","Sa. , KW 43",null,null,null,"2019-11-26","Di. , KW 48",{"$f":"IF(W70=Feiertage!$B$31,\"VolkstT.\",IF(W70=Feiertage!$B$32,\"Buß-BetT\",IF(W70=Feiertage!$B$33,\"Totenso.\",(IF(W70=Feiertage!$B$35,\"1. Advent\",\"\")))))","v":""},null,null,"2019-12-26","Do. , KW 52",{"$f":"Feiertage!A41","v":"2. Weihn. T."}]
[null,"2019-07-27","Sa. , KW 30",null,null,null,"2019-08-27","Di. , KW 35",null,null,null,null,"2019-09-27","Fr. , KW 39",null,null,null,"2019-10-27","So. , KW 44",null,null,null,"2019-11-27","Mi. , KW 48",{"$f":"IF(W71=Feiertage!$B$31,\"VolkstT.\",IF(W71=Feiertage!$B$32,\"Buß-BetT\",IF(W71=Feiertage!$B$33,\"Totenso.\",(IF(W71=Feiertage!$B$35,\"1. Advent\",\"\")))))","v":""},null,null,"2019-12-27","Fr. , KW 52"]
[null,"2019-07-28","So. , KW 31",null,null,null,"2019-08-28","Mi. , KW 35",null,null,null,null,"2019-09-28","Sa. , KW 39",null,null,null,"2019-10-28","Mo. , KW 44",null,null,null,"2019-11-28","Do. , KW 48",{"$f":"IF(W72=Feiertage!$B$31,\"VolkstT.\",IF(W72=Feiertage!$B$32,\"Buß-BetT\",IF(W72=Feiertage!$B$33,\"Totenso.\",(IF(W72=Feiertage!$B$35,\"1. Advent\",\"\")))))","v":""},null,null,"2019-12-28","Sa. , KW 52"]
[null,"2019-07-29","Mo. , KW 31",null,null,null,"2019-08-29","Do. , KW 35",null,null,null,null,"2019-09-29","So. , KW 40",null,null,null,"2019-10-29","Di. , KW 44",null,null,null,"2019-11-29","Fr. , KW 48",{"$f":"IF(W73=Feiertage!$B$31,\"VolkstT.\",IF(W73=Feiertage!$B$32,\"Buß-BetT\",IF(W73=Feiertage!$B$33,\"Totenso.\",(IF(W73=Feiertage!$B$35,\"1. Advent\",\"\")))))","v":""},null,null,"2019-12-29","So. , KW 53"]
[null,"2019-07-30","Di. , KW 31",null,null,null,"2019-08-30","Fr. , KW 35",null,null,null,null,"2019-09-30","Mo. , KW 40",null,null,null,"2019-10-30","Mi. , KW 44",null,null,null,"2019-11-30","Sa. , KW 48",{"$f":"IF(W74=Feiertage!$B$31,\"VolkstT.\",IF(W74=Feiertage!$B$32,\"Buß-BetT\",IF(W74=Feiertage!$B$33,\"Totenso.\",(IF(W74=Feiertage!$B$35,\"1. Advent\",\"\")))))","v":""},null,null,"2019-12-30","Mo. , KW 53"]
[null,"2019-07-31","Mi. , KW 31",null,null,null,"2019-08-31","Sa. , KW 35",null,null,null,null,null,null,null,null,null,"2019-10-31","Do. , KW 44",{"$f":"Feiertage!A26","v":"ReformT."},null,null,null,null,null,null,null,"2019-12-31","Di. , KW 53",{"$f":"Feiertage!A42","v":"Silvester"}]

{"sheet":"LiesMich","index":1,"n_rows":4,"n_cols":2,"rows_kept":4,"cut":false,"hidden":false,"merged":[]}
[]
[]
[null,"Die Funktionen dieser EXCEL-Datei sind im Moment noch im:"]
[null,"Prototypen-Status zum Testen; keine Gewähr"]

{"sheet":"Kalender-Original","index":2,"n_rows":71,"n_cols":32,"rows_kept":71,"cut":false,"hidden":false,"merged":[[0,1,0,2],[5,15,5,17]]}
[{"$f":"DATE(B1,1,1)","v":"2014-01-01"},2014]
[{"$f":"IF(AND(DAY(DATE(YEAR(A1),3,))=29,YEAR(A1)<>1900),\"Schaltjahr\",\"kein Schaltjahr\")","v":"kein Schaltjahr"},{"$f":"DATE(B1,MONTH(TODAY()),DAY(TODAY()))","v":"2014-10-25"}]
["Heute:"]
[{"$f":"TODAY()","v":"2019-10-25"},null,"!!! Feiertagssteuerung ist auf Tabellenblatt   \"Kalender-Laengs\" umgestellt, bis gemeinsame Nutzung des Tabellenblatts \"Feiertage\"  geklärt ist."]
[]
[null," ",null,{"$f":"A3","v":"Heute:"},{"$f":"A4","v":"2019-10-25"},null,null,null,null,null,null,null,null,null,null,{"$f":"B1","v":2014}]
["Januar",{"$f":"A1","v":"2014-01-01"},{"$f":"B7+1","v":"2014-01-02"},{"$f":"C7+1","v":"2014-01-03"},"2014-01-04","2014-01-05","2014-01-06","2014-01-07","2014-01-08","2014-01-09","2014-01-10","2014-01-11","2014-01-12","2014-01-13","2014-01-14","2014-01-15","2014-01-16","2014-01-17","2014-01-18","2014-01-19","2014-01-20","2014-01-21","2014-01-22","2014-01-23","2014-01-24","2014-01-25","2014-01-26","2014-01-27","2014-01-28","2014-01-29","2014-01-30","2014-01-31"]
[null,{"$f":"TEXT(WEEKDAY(B7),\"TTT.\")  &\" , KW \"&WEEKNUM(B7)","v":"Mi. , KW 1"},{"$f":"TEXT(WEEKDAY(C7),\"TTT.\")  &\" , KW \"&WEEKNUM(C7)","v":"Do. , KW 1"},"Fr. , KW 1","Sa. , KW 1","So. , KW 2","Mo. , KW 2","Di. , KW 2","Mi. , KW 2","Do. , KW 2","Fr. , KW 2","Sa. , KW 2","So. , KW 3","Mo. , KW 3","Di. , KW 3","Mi. , KW 3","Do. , KW 3","Fr. , KW 3","Sa. , KW 3","So. , KW 4","Mo. , KW 4","Di. , KW 4","Mi. , KW 4","Do. , KW 4","Fr. , KW 4","Sa. , KW 4","So. , KW 5","Mo. , KW 5","Di. , KW 5","Mi. , KW 5","Do. , KW 5","Fr. , KW 5"]
[null,{"$f":"Feiertage!A2","v":"Neujahr"},null,null,null,null,{"$f":"Feiertage!A3","v":"Hl. 3 Könige"}]
[]
["Februar",{"$f":"B7+31","v":"2014-02-01"},{"$f":"B11+1","v":"2014-02-02"},{"$f":"C11+1","v":"2014-02-03"},"2014-02-04","2014-02-05","2014-02-06","2014-02-07","2014-02-08","2014-02-09","2014-02-10","2014-02-11","2014-02-12","2014-02-13","2014-02-14","2014-02-15","2014-02-16","2014-02-17","2014-02-18","2014-02-19","2014-02-20","2014-02-21","2014-02-22","2014-02-23","2014-02-24","2014-02-25","2014-02-26","2014-02-27","2014-02-28",{"$f":"IF(A2=\"Schaltjahr\",AC11+1,\"\")","v":""}]
[null,{"$f":"TEXT(WEEKDAY(B11),\"TTT.\")  &\" , KW \"&WEEKNUM(B11)","v":"Sa. , KW 5"},{"$f":"TEXT(WEEKDAY(C11),\"TTT.\")  &\" , KW \"&WEEKNUM(C11)","v":"So. , KW 6"},"Mo. , KW 6","Di. , KW 6","Mi. , KW 6","Do. , KW 6","Fr. , KW 6","Sa. , KW 6","So. , KW 7","Mo. , KW 7","Di. , KW 7","Mi. , KW 7","Do. , KW 7","Fr. , KW 7","Sa. , KW 7","So. , KW 8","Mo. , KW 8","Di. , KW 8","Mi. , KW 8","Do. , KW 8","Fr. , KW 8","Sa. , KW 8","So. , KW 9","Mo. , KW 9","Di. , KW 9","Mi. , KW 9","Do. , KW 9","Fr. , KW 9",{"$f":"IF(AD11=\"\",\"\",TEXT(WEEKDAY(AD11),\"TTT.\")  &\" , KW \"&WEEKNUM(AD11))","v":""}]
[null,{"$f":"IF(B11=Feiertage!$B$7,\"Altweiberf.\",IF(B11=Feiertage!$B$8,\"Rosenmo.\",\"\"))","v":""},{"$f":"IF(C11=Feiertage!$B$7,\"Altweiberf.\",IF(C11=Feiertage!$B$8,\"Rosenmo.\",\"\"))","v":""},{"$f":"IF(D11=Feiertage!$B$7,\"Altweiberf.\",IF(D11=Feiertage!$B$8,\"Rosenmo.\",\"\"))","v":""},{"$f":"IF(E11=Feiertage!$B$7,\"Altweiberf.\",IF(E11=Feiertage!$B$8,\"Rosenmo.\",\"\"))","v":""},{"$f":"IF(F11=Feiertage!$B$7,\"Altweiberf.\",IF(F11=Feiertage!$B$8,\"Rosenmo.\",\"\"))","v":""},{"$f":"IF(G11=Feiertage!$B$7,\"Altweiberf.\",IF(G11=Feiertage!$B$8,\"Rosenmo.\",\"\"))","v":""},{"$f":"IF(H11=Feiertage!$B$7,\"Altweiberf.\",IF(H11=Feiertage!$B$8,\"Rosenmo.\",\"\"))","v":""},{"$f":"IF(I11=Feiertage!$B$7,\"Altweiberf.\",IF(I11=Feiertage!$B$8,\"Rosenmo.\",\"\"))","v":""},{"$f":"IF(J11=Feiertage!$B$7,\"Altweiberf.\",IF(J11=Feiertage!$B$8,\"Rosenmo.\",\"\"))","v":""},{"$f":"IF(K11=Feiertage!$B$7,\"Altweiberf.\",IF(K11=Feiertage!$B$8,\"Rosenmo.\",\"\"))","v":""},{"$f":"IF(L11=Feiertage!$B$7,\"Altweiberf.\",IF(L11=Feiertage!$B$8,\"Rosenmo.\",\"\"))","v":""},{"$f":"IF(M11=Feiertage!$B$7,\"Altweiberf.\",IF(M11=Feiertage!$B$8,\"Rosenmo.\",\"\"))","v":""},{"$f":"IF(N11=Feiertage!$B$7,\"Altweiberf.\",IF(N11=Feiertage!$B$8,\"Rosenmo.\",\"\"))","v":""},{"$f":"IF(O11=Feiertage!$B$7,\"Altweiberf.\",IF(O11=Feiertage!$B$8,\"Rosenmo.\",\"\"))","v":""},{"$f":"IF(P11=Feiertage!$B$7,\"Altweiberf.\",IF(P11=Feiertage!$B$8,\"Rosenmo.\",\"\"))","v":""},{"$f":"IF(Q11=Feiertage!$B$7,\"Altweiberf.\",IF(Q11=Feiertage!$B$8,\"Rosenmo.\",\"\"))","v":""},{"$f":"IF(R11=Feiertage!$B$7,\"Altweiberf.\",IF(R11=Feiertage!$B$8,\"Rosenmo.\",\"\"))","v":""},{"$f":"IF(S11=Feiertage!$B$7,\"Altweiberf.\",IF(S11=Feiertage!$B$8,\"Rosenmo.\",\"\"))","v":""},{"$f":"IF(T11=Feiertage!$B$7,\"Altweiberf.\",IF(T11=Feiertage!$B$8,\"Rosenmo.\",\"\"))","v":""},{"$f":"IF(U11=Feiertage!$B$7,\"Altweiberf.\",IF(U11=Feiertage!$B$8,\"Rosenmo.\",\"\"))","v":""},{"$f":"IF(V11=Feiertage!$B$7,\"Altweiberf.\",IF(V11=Feiertage!$B$8,\"Rosenmo.\",\"\"))","v":""},{"$f":"IF(W11=Feiertage!$B$7,\"Altweiberf.\",IF(W11=Feiertage!$B$8,\"Rosenmo.\",\"\"))","v":""},{"$f":"IF(X11=Feiertage!$B$7,\"Altweiberf.\",IF(X11=Feiertage!$B$8,\"Rosenmo.\",\"\"))","v":""},{"$f":"IF(Y11=Feiertage!$B$7,\"Altweiberf.\",IF(Y11=Feiertage!$B$8,\"Rosenmo.\",\"\"))","v":""},{"$f":"IF(Z11=Feiertage!$B$7,\"Altweiberf.\",IF(Z11=Feiertage!$B$8,\"Rosenmo.\",\"\"))","v":""},{"$f":"IF(AA11=Feiertage!$B$7,\"Altweiberf.\",IF(AA11=Feiertage!$B$8,\"Rosenmo.\",\"\"))","v":""},{"$f":"IF(AB11=Feiertage!$B$7,\"Altweiberf.\",IF(AB11=Feiertage!$B$8,\"Rosenmo.\",\"\"))","v":""},{"$f":"IF(AC11=Feiertage!$B$7,\"Altweiberf.\",IF(AC11=Feiertage!$B$8,\"Rosenmo.\",\"\"))","v":""},{"$f":"IF(AD11=Feiertage!$B$7,\"Altweiberf.\",IF(AD11=Feiertage!$B$8,\"Rosenmo.\",\"\"))","v":""},{"$f":"IF(AE11=Feiertage!$B$7,\"Altweiberf.\",IF(AE11=Feiertage!$B$8,\"Rosenmo.\",\"\"))","v":""},{"$f":"IF(AF11=Feiertage!$B$7,\"Altweiberf.\",IF(AF11=Feiertage!$B$8,\"Rosenmo.\",\"\"))","v":""}]
[]
["März",{"$f":"IF(A2=\"Schaltjahr\",B11+29,B11+28)","v":"2014-03-01"},{"$f":"B15+1","v":"2014-03-02"},{"$f":"C15+1","v":"2014-03-03"},"2014-03-04","2014-03-05","2014-03-06","2014-03-07","2014-03-08","2014-03-09","2014-03-10","2014-03-11","2014-03-12","2014-03-13","2014-03-14","2014-03-15","2014-03-16","2014-03-17","2014-03-18","2014-03-19","2014-03-20","2014-03-21","2014-03-22","2014-03-23","2014-03-24","2014-03-25","2014-03-26","2014-03-27","2014-03-28","2014-03-29","2014-03-30","2014-03-31"]
[null,{"$f":"TEXT(WEEKDAY(B15),\"TTT.\")  &\" , KW \"&WEEKNUM(B15)","v":"Sa. , KW 9"},{"$f":"TEXT(WEEKDAY(C15),\"TTT.\")  &\" , KW \"&WEEKNUM(C15)","v":"So. , KW 10"},"Mo. , KW 10","Di. , KW 10","Mi. , KW 10","Do. , KW 10","Fr. , KW 10","Sa. , KW 10","So. , KW 11","Mo. , KW 11","Di. , KW 11","Mi. , KW 11","Do. , KW 11","Fr. , KW 11","Sa. , KW 11","So. , KW 12","Mo. , KW 12","Di. , KW 12","Mi. , KW 12","Do. , KW 12","Fr. , KW 12","Sa. , KW 12","So. , KW 13","Mo. , KW 13","Di. , KW 13","Mi. , KW 13","Do. , KW 13","Fr. , KW 13","Sa. , KW 13","So. , KW 14","Mo. , KW 14"]
[null,null,null,{"$f":"IF(D15=Feiertage!$B$10,\"Kar-Fr.\",IF(D15=Feiertage!$B$11,\"Oster-Sa.\",IF(D15=Feiertage!$B$12,\"Oster-So.\",IF(D15=Feiertage!$B$13,\"Oster-Mo.\",\"\"))))","v":""},{"$f":"IF(E15=Feiertage!$B$10,\"Kar-Fr.\",IF(E15=Feiertage!$B$11,\"Oster-Sa.\",IF(E15=Feiertage!$B$12,\"Oster-So.\",IF(E15=Feiertage!$B$13,\"Oster-Mo.\",\"\"))))","v":""},{"$f":"IF(F15=Feiertage!$B$10,\"Kar-Fr.\",IF(F15=Feiertage!$B$11,\"Oster-Sa.\",IF(F15=Feiertage!$B$12,\"Oster-So.\",IF(F15=Feiertage!$B$13,\"Oster-Mo.\",\"\"))))","v":""},{"$f":"IF(G15=Feiertage!$B$10,\"Kar-Fr.\",IF(G15=Feiertage!$B$11,\"Oster-Sa.\",IF(G15=Feiertage!$B$12,\"Oster-So.\",IF(G15=Feiertage!$B$13,\"Oster-Mo.\",\"\"))))","v":""},{"$f":"IF(H15=Feiertage!$B$10,\"Kar-Fr.\",IF(H15=Feiertage!$B$11,\"Oster-Sa.\",IF(H15=Feiertage!$B$12,\"Oster-So.\",IF(H15=Feiertage!$B$13,\"Oster-Mo.\",\"\"))))","v":""},{"$f":"IF(I15=Feiertage!$B$10,\"Kar-Fr.\",IF(I15=Feiertage!$B$11,\"Oster-Sa.\",IF(I15=Feiertage!$B$12,\"Oster-So.\",IF(I15=Feiertage!$B$13,\"Oster-Mo.\",\"\"))))","v":""},{"$f":"IF(J15=Feiertage!$B$10,\"Kar-Fr.\",IF(J15=Feiertage!$B$11,\"Oster-Sa.\",IF(J15=Feiertage!$B$12,\"Oster-So.\",IF(J15=Feiertage!$B$13,\"Oster-Mo.\",\"\"))))","v":""},{"$f":"IF(K15=Feiertage!$B$10,\"Kar-Fr.\",IF(K15=Feiertage!$B$11,\"Oster-Sa.\",IF(K15=Feiertage!$B$12,\"Oster-So.\",IF(K15=Feiertage!$B$13,\"Oster-Mo.\",\"\"))))","v":""},{"$f":"IF(L15=Feiertage!$B$10,\"Kar-Fr.\",IF(L15=Feiertage!$B$11,\"Oster-Sa.\",IF(L15=Feiertage!$B$12,\"Oster-So.\",IF(L15=Feiertage!$B$13,\"Oster-Mo.\",\"\"))))","v":""},{"$f":"IF(M15=Feiertage!$B$10,\"Kar-Fr.\",IF(M15=Feiertage!$B$11,\"Oster-Sa.\",IF(M15=Feiertage!$B$12,\"Oster-So.\",IF(M15=Feiertage!$B$13,\"Oster-Mo.\",\"\"))))","v":""},{"$f":"IF(N15=Feiertage!$B$10,\"Kar-Fr.\",IF(N15=Feiertage!$B$11,\"Oster-Sa.\",IF(N15=Feiertage!$B$12,\"Oster-So.\",IF(N15=Feiertage!$B$13,\"Oster-Mo.\",\"\"))))","v":""},{"$f":"IF(O15=Feiertage!$B$10,\"Kar-Fr.\",IF(O15=Feiertage!$B$11,\"Oster-Sa.\",IF(O15=Feiertage!$B$12,\"Oster-So.\",IF(O15=Feiertage!$B$13,\"Oster-Mo.\",\"\"))))","v":""},{"$f":"IF(P15=Feiertage!$B$10,\"Kar-Fr.\",IF(P15=Feiertage!$B$11,\"Oster-Sa.\",IF(P15=Feiertage!$B$12,\"Oster-So.\",IF(P15=Feiertage!$B$13,\"Oster-Mo.\",\"\"))))","v":""},{"$f":"IF(Q15=Feiertage!$B$10,\"Kar-Fr.\",IF(Q15=Feiertage!$B$11,\"Oster-Sa.\",IF(Q15=Feiertage!$B$12,\"Oster-So.\",IF(Q15=Feiertage!$B$13,\"Oster-Mo.\",\"\"))))","v":""},{"$f":"IF(R15=Feiertage!$B$10,\"Kar-Fr.\",IF(R15=Feiertage!$B$11,\"Oster-Sa.\",IF(R15=Feiertage!$B$12,\"Oster-So.\",IF(R15=Feiertage!$B$13,\"Oster-Mo.\",\"\"))))","v":""},{"$f":"IF(S15=Feiertage!$B$10,\"Kar-Fr.\",IF(S15=Feiertage!$B$11,\"Oster-Sa.\",IF(S15=Feiertage!$B$12,\"Oster-So.\",IF(S15=Feiertage!$B$13,\"Oster-Mo.\",\"\"))))","v":""},{"$f":"IF(T15=Feiertage!$B$10,\"Kar-Fr.\",IF(T15=Feiertage!$B$11,\"Oster-Sa.\",IF(T15=Feiertage!$B$12,\"Oster-So.\",IF(T15=Feiertage!$B$13,\"Oster-Mo.\",\"\"))))","v":""},{"$f":"IF(U15=Feiertage!$B$10,\"Kar-Fr.\",IF(U15=Feiertage!$B$11,\"Oster-Sa.\",IF(U15=Feiertage!$B$12,\"Oster-So.\",IF(U15=Feiertage!$B$13,\"Oster-Mo.\",\"\"))))","v":""},{"$f":"IF(V15=Feiertage!$B$10,\"Kar-Fr.\",IF(V15=Feiertage!$B$11,\"Oster-Sa.\",IF(V15=Feiertage!$B$12,\"Oster-So.\",IF(V15=Feiertage!$B$13,\"Oster-Mo.\",\"\"))))","v":""},{"$f":"IF(W15=Feiertage!$B$10,\"Kar-Fr.\",IF(W15=Feiertage!$B$11,\"Oster-Sa.\",IF(W15=Feiertage!$B$12,\"Oster-So.\",IF(W15=Feiertage!$B$13,\"Oster-Mo.\",\"\"))))","v":""},{"$f":"IF(X15=Feiertage!$B$10,\"Kar-Fr.\",IF(X15=Feiertage!$B$11,\"Oster-Sa.\",IF(X15=Feiertage!$B$12,\"Oster-So.\",IF(X15=Feiertage!$B$13,\"Oster-Mo.\",\"\"))))","v":""},{"$f":"IF(Y15=Feiertage!$B$10,\"Kar-Fr.\",IF(Y15=Feiertage!$B$11,\"Oster-Sa.\",IF(Y15=Feiertage!$B$12,\"Oster-So.\",IF(Y15=Feiertage!$B$13,\"Oster-Mo.\",\"\"))))","v":""},{"$f":"IF(Z15=Feiertage!$B$10,\"Kar-Fr.\",IF(Z15=Feiertage!$B$11,\"Oster-Sa.\",IF(Z15=Feiertage!$B$12,\"Oster-So.\",IF(Z15=Feiertage!$B$13,\"Oster-Mo.\",\"\"))))","v":""},{"$f":"IF(AA15=Feiertage!$B$10,\"Kar-Fr.\",IF(AA15=Feiertage!$B$11,\"Oster-Sa.\",IF(AA15=Feiertage!$B$12,\"Oster-So.\",IF(AA15=Feiertage!$B$13,\"Oster-Mo.\",\"\"))))","v":""},{"$f":"IF(AB15=Feiertage!$B$10,\"Kar-Fr.\",IF(AB15=Feiertage!$B$11,\"Oster-Sa.\",IF(AB15=Feiertage!$B$12,\"Oster-So.\",IF(AB15=Feiertage!$B$13,\"Oster-Mo.\",\"\"))))","v":""},{"$f":"IF(AC15=Feiertage!$B$10,\"Kar-Fr.\",IF(AC15=Feiertage!$B$11,\"Oster-Sa.\",IF(AC15=Feiertage!$B$12,\"Oster-So.\",IF(AC15=Feiertage!$B$13,\"Oster-Mo.\",\"\"))))","v":""},{"$f":"IF(AD15=Feiertage!$B$10,\"Kar-Fr.\",IF(AD15=Feiertage!$B$11,\"Oster-Sa.\",IF(AD15=Feiertage!$B$12,\"Oster-So.\",IF(AD15=Feiertage!$B$13,\"Oster-Mo.\",\"\"))))","v":""},{"$f":"IF(AE15=Feiertage!$B$10,\"Kar-Fr.\",IF(AE15=Feiertage!$B$11,\"Oster-Sa.\",IF(AE15=Feiertage!$B$12,\"Oster-So.\",IF(AE15=Feiertage!$B$13,\"Oster-Mo.\",\"\"))))","v":""},{"$f":"IF(AF15=Feiertage!$B$10,\"Kar-Fr.\",IF(AF15=Feiertage!$B$11,\"Oster-Sa.\",IF(AF15=Feiertage!$B$12,\"Oster-So.\",IF(AF15=Feiertage!$B$13,\"Oster-Mo.\",\"\"))))","v":""}]
[]
["April",{"$f":"B15+31","v":"2014-04-01"},{"$f":"B19+1","v":"2014-04-02"},{"$f":"C19+1","v":"2014-04-03"},"2014-04-04","2014-04-05","2014-04-06","2014-04-07","2014-04-08","2014-04-09","2014-04-10","2014-04-11","2014-04-12","2014-04-13","2014-04-14","2014-04-15","2014-04-16","2014-04-17","2014-04-18","2014-04-19","2014-04-20","2014-04-21","2014-04-22","2014-04-23","2014-04-24","2014-04-25","2014-04-26","2014-04-27","2014-04-28","2014-04-29","2014-04-30"]
[null,{"$f":"TEXT(WEEKDAY(B19),\"TTT.\")  &\" , KW \"&WEEKNUM(B19)","v":"Di. , KW 14"},{"$f":"TEXT(WEEKDAY(C19),\"TTT.\")  &\" , KW \"&WEEKNUM(C19)","v":"Mi. , KW 14"},"Do. , KW 14","Fr. , KW 14","Sa. , KW 14","So. , KW 15","Mo. , KW 15","Di. , KW 15","Mi. , KW 15","Do. , KW 15","Fr. , KW 15","Sa. , KW 15","So. , KW 16","Mo. , KW 16","Di. , KW 16","Mi. , KW 16","Do. , KW 16","Fr. , KW 16","Sa. , KW 16","So. , KW 17","Mo. , KW 17","Di. , KW 17","Mi. , KW 17","Do. , KW 17","Fr. , KW 17","Sa. , KW 17","So. , KW 18","Mo. , KW 18","Di. , KW 18","Mi. , KW 18"]
[null,{"$f":"IF(B19=Feiertage!$B$10,\"Kar-Fr.\",IF(B19=Feiertage!$B$11,\"Oster-Sa.\",IF(B19=Feiertage!$B$12,\"Oster-So.\",IF(B19=Feiertage!$B$13,\"Oster-Mo.\",\"\"))))","v":""},{"$f":"IF(C19=Feiertage!$B$10,\"Kar-Fr.\",IF(C19=Feiertage!$B$11,\"Oster-Sa.\",IF(C19=Feiertage!$B$12,\"Oster-So.\",IF(C19=Feiertage!$B$13,\"Oster-Mo.\",\"\"))))","v":""},{"$f":"IF(D19=Feiertage!$B$10,\"Kar-Fr.\",IF(D19=Feiertage!$B$11,\"Oster-Sa.\",IF(D19=Feiertage!$B$12,\"Oster-So.\",IF(D19=Feiertage!$B$13,\"Oster-Mo.\",\"\"))))","v":""},{"$f":"IF(E19=Feiertage!$B$10,\"Kar-Fr.\",IF(E19=Feiertage!$B$11,\"Oster-Sa.\",IF(E19=Feiertage!$B$12,\"Oster-So.\",IF(E19=Feiertage!$B$13,\"Oster-Mo.\",\"\"))))","v":""},{"$f":"IF(F19=Feiertage!$B$10,\"Kar-Fr.\",IF(F19=Feiertage!$B$11,\"Oster-Sa.\",IF(F19=Feiertage!$B$12,\"Oster-So.\",IF(F19=Feiertage!$B$13,\"Oster-Mo.\",\"\"))))","v":""},{"$f":"IF(G19=Feiertage!$B$10,\"Kar-Fr.\",IF(G19=Feiertage!$B$11,\"Oster-Sa.\",IF(G19=Feiertage!$B$12,\"Oster-So.\",IF(G19=Feiertage!$B$13,\"Oster-Mo.\",\"\"))))","v":""},{"$f":"IF(H19=Feiertage!$B$10,\"Kar-Fr.\",IF(H19=Feiertage!$B$11,\"Oster-Sa.\",IF(H19=Feiertage!$B$12,\"Oster-So.\",IF(H19=Feiertage!$B$13,\"Oster-Mo.\",\"\"))))","v":""},{"$f":"IF(I19=Feiertage!$B$10,\"Kar-Fr.\",IF(I19=Feiertage!$B$11,\"Oster-Sa.\",IF(I19=Feiertage!$B$12,\"Oster-So.\",IF(I19=Feiertage!$B$13,\"Oster-Mo.\",\"\"))))","v":""},{"$f":"IF(J19=Feiertage!$B$10,\"Kar-Fr.\",IF(J19=Feiertage!$B$11,\"Oster-Sa.\",IF(J19=Feiertage!$B$12,\"Oster-So.\",IF(J19=Feiertage!$B$13,\"Oster-Mo.\",\"\"))))","v":""},{"$f":"IF(K19=Feiertage!$B$10,\"Kar-Fr.\",IF(K19=Feiertage!$B$11,\"Oster-Sa.\",IF(K19=Feiertage!$B$12,\"Oster-So.\",IF(K19=Feiertage!$B$13,\"Oster-Mo.\",\"\"))))","v":""},{"$f":"IF(L19=Feiertage!$B$10,\"Kar-Fr.\",IF(L19=Feiertage!$B$11,\"Oster-Sa.\",IF(L19=Feiertage!$B$12,\"Oster-So.\",IF(L19=Feiertage!$B$13,\"Oster-Mo.\",\"\"))))","v":""},{"$f":"IF(M19=Feiertage!$B$10,\"Kar-Fr.\",IF(M19=Feiertage!$B$11,\"Oster-Sa.\",IF(M19=Feiertage!$B$12,\"Oster-So.\",IF(M19=Feiertage!$B$13,\"Oster-Mo.\",\"\"))))","v":""},{"$f":"IF(N19=Feiertage!$B$10,\"Kar-Fr.\",IF(N19=Feiertage!$B$11,\"Oster-Sa.\",IF(N19=Feiertage!$B$12,\"Oster-So.\",IF(N19=Feiertage!$B$13,\"Oster-Mo.\",\"\"))))","v":""},{"$f":"IF(O19=Feiertage!$B$10,\"Kar-Fr.\",IF(O19=Feiertage!$B$11,\"Oster-Sa.\",IF(O19=Feiertage!$B$12,\"Oster-So.\",IF(O19=Feiertage!$B$13,\"Oster-Mo.\",\"\"))))","v":""},{"$f":"IF(P19=Feiertage!$B$10,\"Kar-Fr.\",IF(P19=Feiertage!$B$11,\"Oster-Sa.\",IF(P19=Feiertage!$B$12,\"Oster-So.\",IF(P19=Feiertage!$B$13,\"Oster-Mo.\",\"\"))))","v":""},{"$f":"IF(Q19=Feiertage!$B$10,\"Kar-Fr.\",IF(Q19=Feiertage!$B$11,\"Oster-Sa.\",IF(Q19=Feiertage!$B$12,\"Oster-So.\",IF(Q19=Feiertage!$B$13,\"Oster-Mo.\",\"\"))))","v":""},{"$f":"IF(R19=Feiertage!$B$10,\"Kar-Fr.\",IF(R19=Feiertage!$B$11,\"Oster-Sa.\",IF(R19=Feiertage!$B$12,\"Oster-So.\",IF(R19=Feiertage!$B$13,\"Oster-Mo.\",\"\"))))","v":""},{"$f":"IF(S19=Feiertage!$B$10,\"Kar-Fr.\",IF(S19=Feiertage!$B$11,\"Oster-Sa.\",IF(S19=Feiertage!$B$12,\"Oster-So.\",IF(S19=Feiertage!$B$13,\"Oster-Mo.\",\"\"))))","v":""},{"$f":"IF(T19=Feiertage!$B$10,\"Kar-Fr.\",IF(T19=Feiertage!$B$11,\"Oster-Sa.\",IF(T19=Feiertage!$B$12,\"Oster-So.\",IF(T19=Feiertage!$B$13,\"Oster-Mo.\",\"\"))))","v":""},{"$f":"IF(U19=Feiertage!$B$10,\"Kar-Fr.\",IF(U19=Feiertage!$B$11,\"Oster-Sa.\",IF(U19=Feiertage!$B$12,\"Oster-So.\",IF(U19=Feiertage!$B$13,\"Oster-Mo.\",\"\"))))","v":""},{"$f":"IF(V19=Feiertage!$B$10,\"Kar-Fr.\",IF(V19=Feiertage!$B$11,\"Oster-Sa.\",IF(V19=Feiertage!$B$12,\"Oster-So.\",IF(V19=Feiertage!$B$13,\"Oster-Mo.\",\"\"))))","v":""},{"$f":"IF(W19=Feiertage!$B$10,\"Kar-Fr.\",IF(W19=Feiertage!$B$11,\"Oster-Sa.\",IF(W19=Feiertage!$B$12,\"Oster-So.\",IF(W19=Feiertage!$B$13,\"Oster-Mo.\",\"\"))))","v":""},{"$f":"IF(X19=Feiertage!$B$10,\"Kar-Fr.\",IF(X19=Feiertage!$B$11,\"Oster-Sa.\",IF(X19=Feiertage!$B$12,\"Oster-So.\",IF(X19=Feiertage!$B$13,\"Oster-Mo.\",\"\"))))","v":""},{"$f":"IF(Y19=Feiertage!$B$10,\"Kar-Fr.\",IF(Y19=Feiertage!$B$11,\"Oster-Sa.\",IF(Y19=Feiertage!$B$12,\"Oster-So.\",IF(Y19=Feiertage!$B$13,\"Oster-Mo.\",\"\"))))","v":""},{"$f":"IF(Z19=Feiertage!$B$10,\"Kar-Fr.\",IF(Z19=Feiertage!$B$11,\"Oster-Sa.\",IF(Z19=Feiertage!$B$12,\"Oster-So.\",IF(Z19=Feiertage!$B$13,\"Oster-Mo.\",\"\"))))","v":""},{"$f":"IF(AA19=Feiertage!$B$10,\"Kar-Fr.\",IF(AA19=Feiertage!$B$11,\"Oster-Sa.\",IF(AA19=Feiertage!$B$12,\"Oster-So.\",IF(AA19=Feiertage!$B$13,\"Oster-Mo.\",\"\"))))","v":""},{"$f":"IF(AB19=Feiertage!$B$10,\"Kar-Fr.\",IF(AB19=Feiertage!$B$11,\"Oster-Sa.\",IF(AB19=Feiertage!$B$12,\"Oster-So.\",IF(AB19=Feiertage!$B$13,\"Oster-Mo.\",\"\"))))","v":""},{"$f":"IF(AC19=Feiertage!$B$10,\"Kar-Fr.\",IF(AC19=Feiertage!$B$11,\"Oster-Sa.\",IF(AC19=Feiertage!$B$12,\"Oster-So.\",IF(AC19=Feiertage!$B$13,\"Oster-Mo.\",\"\"))))","v":""},{"$f":"IF(AD19=Feiertage!$B$10,\"Kar-Fr.\",IF(AD19=Feiertage!$B$11,\"Oster-Sa.\",IF(AD19=Feiertage!$B$12,\"Oster-So.\",IF(AD19=Feiertage!$B$13,\"Oster-Mo.\",\"\"))))","v":""},{"$f":"IF(AE19=Feiertage!$B$10,\"Kar-Fr.\",IF(AE19=Feiertage!$B$11,\"Oster-Sa.\",IF(AE19=Feiertage!$B$12,\"Oster-So.\",IF(AE19=Feiertage!$B$13,\"Oster-Mo.\",\"\"))))","v":""},{"$f":"IF(AF19=Feiertage!$B$10,\"Kar-Fr.\",IF(AF19=Feiertage!$B$11,\"Oster-Sa.\",IF(AF19=Feiertage!$B$12,\"Oster-So.\",IF(AF19=Feiertage!$B$13,\"Oster-Mo.\",\"\"))))","v":""}]
[]
["Mai",{"$f":"B19+30","v":"2014-05-01"},{"$f":"B23+1","v":"2014-05-02"},{"$f":"C23+1","v":"2014-05-03"},"2014-05-04","2014-05-05","2014-05-06","2014-05-07","2014-05-08","2014-05-09","2014-05-10","2014-05-11","2014-05-12","2014-05-13","2014-05-14","2014-05-15","2014-05-16","2014-05-17","2014-05-18","2014-05-19","2014-05-20","2014-05-21","2014-05-22","2014-05-23","2014-05-24","2014-05-25","2014-05-26","2014-05-27","2014-05-28","2014-05-29","2014-05-30","2014-05-31"]
[null,{"$f":"TEXT(WEEKDAY(B23),\"TTT.\")  &\" , KW \"&WEEKNUM(B23)","v":"Do. , KW 18"},{"$f":"TEXT(WEEKDAY(C23),\"TTT.\")  &\" , KW \"&WEEKNUM(C23)","v":"Fr. , KW 18"},"Sa. , KW 18","So. , KW 19","Mo. , KW 19","Di. , KW 19","Mi. , KW 19","Do. , KW 19","Fr. , KW 19","Sa. , KW 19","So. , KW 20","Mo. , KW 20","Di. , KW 20","Mi. , KW 20","Do. , KW 20","Fr. , KW 20","Sa. , KW 20","So. , KW 21","Mo. , KW 21","Di. , KW 21","Mi. , KW 21","Do. , KW 21","Fr. , KW 21","Sa. , KW 21","So. , KW 22","Mo. , KW 22","Di. , KW 22","Mi. , KW 22","Do. , KW 22","Fr. , KW 22","Sa. , KW 22"]
[null,{"$f":"Feiertage!A15","v":"Maifeiertag"},{"$f":"IF(C23=Feiertage!$B$16,\"Christi HF.\",IF(C23=Feiertage!$B$17,\"Pfingst-So.\",IF(C23=Feiertage!$B$18,\"Pfingst-Mo.\",IF(C23=Feiertage!$B$20,\"Fronl.\",\"\"))))","v":""},{"$f":"IF(D23=Feiertage!$B$16,\"Christi HF.\",IF(D23=Feiertage!$B$17,\"Pfingst-So.\",IF(D23=Feiertage!$B$18,\"Pfingst-Mo.\",IF(D23=Feiertage!$B$20,\"Fronl.\",\"\"))))","v":""},{"$f":"IF(E23=Feiertage!$B$16,\"Christi HF.\",IF(E23=Feiertage!$B$17,\"Pfingst-So.\",IF(E23=Feiertage!$B$18,\"Pfingst-Mo.\",IF(E23=Feiertage!$B$20,\"Fronl.\",\"\"))))","v":""},{"$f":"IF(F23=Feiertage!$B$16,\"Christi HF.\",IF(F23=Feiertage!$B$17,\"Pfingst-So.\",IF(F23=Feiertage!$B$18,\"Pfingst-Mo.\",IF(F23=Feiertage!$B$20,\"Fronl.\",\"\"))))","v":""},{"$f":"IF(G23=Feiertage!$B$16,\"Christi HF.\",IF(G23=Feiertage!$B$17,\"Pfingst-So.\",IF(G23=Feiertage!$B$18,\"Pfingst-Mo.\",IF(G23=Feiertage!$B$20,\"Fronl.\",\"\"))))","v":""},{"$f":"IF(H23=Feiertage!$B$16,\"Christi HF.\",IF(H23=Feiertage!$B$17,\"Pfingst-So.\",IF(H23=Feiertage!$B$18,\"Pfingst-Mo.\",IF(H23=Feiertage!$B$20,\"Fronl.\",\"\"))))","v":""},{"$f":"IF(I23=Feiertage!$B$16,\"Christi HF.\",IF(I23=Feiertage!$B$17,\"Pfingst-So.\",IF(I23=Feiertage!$B$18,\"Pfingst-Mo.\",IF(I23=Feiertage!$B$20,\"Fronl.\",\"\"))))","v":""},{"$f":"IF(J23=Feiertage!$B$16,\"Christi HF.\",IF(J23=Feiertage!$B$17,\"Pfingst-So.\",IF(J23=Feiertage!$B$18,\"Pfingst-Mo.\",IF(J23=Feiertage!$B$20,\"Fronl.\",\"\"))))","v":""},{"$f":"IF(K23=Feiertage!$B$16,\"Christi HF.\",IF(K23=Feiertage!$B$17,\"Pfingst-So.\",IF(K23=Feiertage!$B$18,\"Pfingst-Mo.\",IF(K23=Feiertage!$B$20,\"Fronl.\",\"\"))))","v":""},{"$f":"IF(L23=Feiertage!$B$16,\"Christi HF.\",IF(L23=Feiertage!$B$17,\"Pfingst-So.\",IF(L23=Feiertage!$B$18,\"Pfingst-Mo.\",IF(L23=Feiertage!$B$20,\"Fronl.\",\"\"))))","v":""},{"$f":"IF(M23=Feiertage!$B$16,\"Christi HF.\",IF(M23=Feiertage!$B$17,\"Pfingst-So.\",IF(M23=Feiertage!$B$18,\"Pfingst-Mo.\",IF(M23=Feiertage!$B$20,\"Fronl.\",\"\"))))","v":""},{"$f":"IF(N23=Feiertage!$B$16,\"Christi HF.\",IF(N23=Feiertage!$B$17,\"Pfingst-So.\",IF(N23=Feiertage!$B$18,\"Pfingst-Mo.\",IF(N23=Feiertage!$B$20,\"Fronl.\",\"\"))))","v":""},{"$f":"IF(O23=Feiertage!$B$16,\"Christi HF.\",IF(O23=Feiertage!$B$17,\"Pfingst-So.\",IF(O23=Feiertage!$B$18,\"Pfingst-Mo.\",IF(O23=Feiertage!$B$20,\"Fronl.\",\"\"))))","v":""},{"$f":"IF(P23=Feiertage!$B$16,\"Christi HF.\",IF(P23=Feiertage!$B$17,\"Pfingst-So.\",IF(P23=Feiertage!$B$18,\"Pfingst-Mo.\",IF(P23=Feiertage!$B$20,\"Fronl.\",\"\"))))","v":""},{"$f":"IF(Q23=Feiertage!$B$16,\"Christi HF.\",IF(Q23=Feiertage!$B$17,\"Pfingst-So.\",IF(Q23=Feiertage!$B$18,\"Pfingst-Mo.\",IF(Q23=Feiertage!$B$20,\"Fronl.\",\"\"))))","v":""},{"$f":"IF(R23=Feiertage!$B$16,\"Christi HF.\",IF(R23=Feiertage!$B$17,\"Pfingst-So.\",IF(R23=Feiertage!$B$18,\"Pfingst-Mo.\",IF(R23=Feiertage!$B$20,\"Fronl.\",\"\"))))","v":""},{"$f":"IF(S23=Feiertage!$B$16,\"Christi HF.\",IF(S23=Feiertage!$B$17,\"Pfingst-So.\",IF(S23=Feiertage!$B$18,\"Pfingst-Mo.\",IF(S23=Feiertage!$B$20,\"Fronl.\",\"\"))))","v":""},{"$f":"IF(T23=Feiertage!$B$16,\"Christi HF.\",IF(T23=Feiertage!$B$17,\"Pfingst-So.\",IF(T23=Feiertage!$B$18,\"Pfingst-Mo.\",IF(T23=Feiertage!$B$20,\"Fronl.\",\"\"))))","v":""},{"$f":"IF(U23=Feiertage!$B$16,\"Christi HF.\",IF(U23=Feiertage!$B$17,\"Pfingst-So.\",IF(U23=Feiertage!$B$18,\"Pfingst-Mo.\",IF(U23=Feiertage!$B$20,\"Fronl.\",\"\"))))","v":""},{"$f":"IF(V23=Feiertage!$B$16,\"Christi HF.\",IF(V23=Feiertage!$B$17,\"Pfingst-So.\",IF(V23=Feiertage!$B$18,\"Pfingst-Mo.\",IF(V23=Feiertage!$B$20,\"Fronl.\",\"\"))))","v":""},{"$f":"IF(W23=Feiertage!$B$16,\"Christi HF.\",IF(W23=Feiertage!$B$17,\"Pfingst-So.\",IF(W23=Feiertage!$B$18,\"Pfingst-Mo.\",IF(W23=Feiertage!$B$20,\"Fronl.\",\"\"))))","v":""},{"$f":"IF(X23=Feiertage!$B$16,\"Christi HF.\",IF(X23=Feiertage!$B$17,\"Pfingst-So.\",IF(X23=Feiertage!$B$18,\"Pfingst-Mo.\",IF(X23=Feiertage!$B$20,\"Fronl.\",\"\"))))","v":""},{"$f":"IF(Y23=Feiertage!$B$16,\"Christi HF.\",IF(Y23=Feiertage!$B$17,\"Pfingst-So.\",IF(Y23=Feiertage!$B$18,\"Pfingst-Mo.\",IF(Y23=Feiertage!$B$20,\"Fronl.\",\"\"))))","v":""},{"$f":"IF(Z23=Feiertage!$B$16,\"Christi HF.\",IF(Z23=Feiertage!$B$17,\"Pfingst-So.\",IF(Z23=Feiertage!$B$18,\"Pfingst-Mo.\",IF(Z23=Feiertage!$B$20,\"Fronl.\",\"\"))))","v":""},{"$f":"IF(AA23=Feiertage!$B$16,\"Christi HF.\",IF(AA23=Feiertage!$B$17,\"Pfingst-So.\",IF(AA23=Feiertage!$B$18,\"Pfingst-Mo.\",IF(AA23=Feiertage!$B$20,\"Fronl.\",\"\"))))","v":""},{"$f":"IF(AB23=Feiertage!$B$16,\"Christi HF.\",IF(AB23=Feiertage!$B$17,\"Pfingst-So.\",IF(AB23=Feiertage!$B$18,\"Pfingst-Mo.\",IF(AB23=Feiertage!$B$20,\"Fronl.\",\"\"))))","v":""},{"$f":"IF(AC23=Feiertage!$B$16,\"Christi HF.\",IF(AC23=Feiertage!$B$17,\"Pfingst-So.\",IF(AC23=Feiertage!$B$18,\"Pfingst-Mo.\",IF(AC23=Feiertage!$B$20,\"Fronl.\",\"\"))))","v":""},{"$f":"IF(AD23=Feiertage!$B$16,\"Christi HF.\",IF(AD23=Feiertage!$B$17,\"Pfingst-So.\",IF(AD23=Feiertage!$B$18,\"Pfingst-Mo.\",IF(AD23=Feiertage!$B$20,\"Fronl.\",\"\"))))","v":""},{"$f":"IF(AE23=Feiertage!$B$16,\"Christi HF.\",IF(AE23=Feiertage!$B$17,\"Pfingst-So.\",IF(AE23=Feiertage!$B$18,\"Pfingst-Mo.\",IF(AE23=Feiertage!$B$20,\"Fronl.\",\"\"))))","v":""},{"$f":"IF(AF23=Feiertage!$B$16,\"Christi HF.\",IF(AF23=Feiertage!$B$17,\"Pfingst-So.\",IF(AF23=Feiertage!$B$18,\"Pfingst-Mo.\",IF(AF23=Feiertage!$B$20,\"Fronl.\",\"\"))))","v":""}]
[]
["Juni",{"$f":"B23+31","v":"2014-06-01"},{"$f":"B27+1","v":"2014-06-02"},{"$f":"C27+1","v":"2014-06-03"},"2014-06-04","2014-06-05","2014-06-06","2014-06-07","2014-06-08","2014-06-09","2014-06-10","2014-06-11","2014-06-12","2014-06-13","2014-06-14","2014-06-15","2014-06-16","2014-06-17","2014-06-18","2014-06-19","2014-06-20","2014-06-21","2014-06-22","2014-06-23","2014-06-24","2014-06-25","2014-06-26","2014-06-27","2014-06-28","2014-06-29","2014-06-30"]
[null,{"$f":"TEXT(WEEKDAY(B27),\"TTT.\")  &\" , KW \"&WEEKNUM(B27)","v":"So. , KW 23"},{"$f":"TEXT(WEEKDAY(C27),\"TTT.\")  &\" , KW \"&WEEKNUM(C27)","v":"Mo. , KW 23"},"Di. , KW 23","Mi. , KW 23","Do. , KW 23","Fr. , KW 23","Sa. , KW 23","So. , KW 24","Mo. , KW 24","Di. , KW 24","Mi. , KW 24","Do. , KW 24","Fr. , KW 24","Sa. , KW 24","So. , KW 25","Mo. , KW 25","Di. , KW 25","Mi. , KW 25","Do. , KW 25","Fr. , KW 25","Sa. , KW 25","So. , KW 26","Mo. , KW 26","Di. , KW 26","Mi. , KW 26","Do. , KW 26","Fr. , KW 26","Sa. , KW 26","So. , KW 27","Mo. , KW 27"]
[null,{"$f":"IF(B27=Feiertage!$B$16,\"Christi HF.\",IF(B27=Feiertage!$B$17,\"Pfingst-So.\",IF(B27=Feiertage!$B$18,\"Pfingst-Mo.\",IF(B27=Feiertage!$B$20,\"Fronl.\",\"\"))))","v":""},{"$f":"IF(C27=Feiertage!$B$16,\"Christi HF.\",IF(C27=Feiertage!$B$17,\"Pfingst-So.\",IF(C27=Feiertage!$B$18,\"Pfingst-Mo.\",IF(C27=Feiertage!$B$20,\"Fronl.\",\"\"))))","v":""},{"$f":"IF(D27=Feiertage!$B$16,\"Christi HF.\",IF(D27=Feiertage!$B$17,\"Pfingst-So.\",IF(D27=Feiertage!$B$18,\"Pfingst-Mo.\",IF(D27=Feiertage!$B$20,\"Fronl.\",\"\"))))","v":""},{"$f":"IF(E27=Feiertage!$B$16,\"Christi HF.\",IF(E27=Feiertage!$B$17,\"Pfingst-So.\",IF(E27=Feiertage!$B$18,\"Pfingst-Mo.\",IF(E27=Feiertage!$B$20,\"Fronl.\",\"\"))))","v":""},{"$f":"IF(F27=Feiertage!$B$16,\"Christi HF.\",IF(F27=Feiertage!$B$17,\"Pfingst-So.\",IF(F27=Feiertage!$B$18,\"Pfingst-Mo.\",IF(F27=Feiertage!$B$20,\"Fronl.\",\"\"))))","v":""},{"$f":"IF(G27=Feiertage!$B$16,\"Christi HF.\",IF(G27=Feiertage!$B$17,\"Pfingst-So.\",IF(G27=Feiertage!$B$18,\"Pfingst-Mo.\",IF(G27=Feiertage!$B$20,\"Fronl.\",\"\"))))","v":""},{"$f":"IF(H27=Feiertage!$B$16,\"Christi HF.\",IF(H27=Feiertage!$B$17,\"Pfingst-So.\",IF(H27=Feiertage!$B$18,\"Pfingst-Mo.\",IF(H27=Feiertage!$B$20,\"Fronl.\",\"\"))))","v":""},{"$f":"IF(I27=Feiertage!$B$16,\"Christi HF.\",IF(I27=Feiertage!$B$17,\"Pfingst-So.\",IF(I27=Feiertage!$B$18,\"Pfingst-Mo.\",IF(I27=Feiertage!$B$20,\"Fronl.\",\"\"))))","v":""},{"$f":"IF(J27=Feiertage!$B$16,\"Christi HF.\",IF(J27=Feiertage!$B$17,\"Pfingst-So.\",IF(J27=Feiertage!$B$18,\"Pfingst-Mo.\",IF(J27=Feiertage!$B$20,\"Fronl.\",\"\"))))","v":""},{"$f":"IF(K27=Feiertage!$B$16,\"Christi HF.\",IF(K27=Feiertage!$B$17,\"Pfingst-So.\",IF(K27=Feiertage!$B$18,\"Pfingst-Mo.\",IF(K27=Feiertage!$B$20,\"Fronl.\",\"\"))))","v":""},{"$f":"IF(L27=Feiertage!$B$16,\"Christi HF.\",IF(L27=Feiertage!$B$17,\"Pfingst-So.\",IF(L27=Feiertage!$B$18,\"Pfingst-Mo.\",IF(L27=Feiertage!$B$20,\"Fronl.\",\"\"))))","v":""},{"$f":"IF(M27=Feiertage!$B$16,\"Christi HF.\",IF(M27=Feiertage!$B$17,\"Pfingst-So.\",IF(M27=Feiertage!$B$18,\"Pfingst-Mo.\",IF(M27=Feiertage!$B$20,\"Fronl.\",\"\"))))","v":""},{"$f":"IF(N27=Feiertage!$B$16,\"Christi HF.\",IF(N27=Feiertage!$B$17,\"Pfingst-So.\",IF(N27=Feiertage!$B$18,\"Pfingst-Mo.\",IF(N27=Feiertage!$B$20,\"Fronl.\",\"\"))))","v":""},{"$f":"IF(O27=Feiertage!$B$16,\"Christi HF.\",IF(O27=Feiertage!$B$17,\"Pfingst-So.\",IF(O27=Feiertage!$B$18,\"Pfingst-Mo.\",IF(O27=Feiertage!$B$20,\"Fronl.\",\"\"))))","v":""},{"$f":"IF(P27=Feiertage!$B$16,\"Christi HF.\",IF(P27=Feiertage!$B$17,\"Pfingst-So.\",IF(P27=Feiertage!$B$18,\"Pfingst-Mo.\",IF(P27=Feiertage!$B$20,\"Fronl.\",\"\"))))","v":""},{"$f":"IF(Q27=Feiertage!$B$16,\"Christi HF.\",IF(Q27=Feiertage!$B$17,\"Pfingst-So.\",IF(Q27=Feiertage!$B$18,\"Pfingst-Mo.\",IF(Q27=Feiertage!$B$20,\"Fronl.\",\"\"))))","v":""},{"$f":"IF(R27=Feiertage!$B$16,\"Christi HF.\",IF(R27=Feiertage!$B$17,\"Pfingst-So.\",IF(R27=Feiertage!$B$18,\"Pfingst-Mo.\",IF(R27=Feiertage!$B$20,\"Fronl.\",\"\"))))","v":""},{"$f":"IF(S27=Feiertage!$B$16,\"Christi HF.\",IF(S27=Feiertage!$B$17,\"Pfingst-So.\",IF(S27=Feiertage!$B$18,\"Pfingst-Mo.\",IF(S27=Feiertage!$B$20,\"Fronl.\",\"\"))))","v":""},{"$f":"IF(T27=Feiertage!$B$16,\"Christi HF.\",IF(T27=Feiertage!$B$17,\"Pfingst-So.\",IF(T27=Feiertage!$B$18,\"Pfingst-Mo.\",IF(T27=Feiertage!$B$20,\"Fronl.\",\"\"))))","v":""},{"$f":"IF(U27=Feiertage!$B$16,\"Christi HF.\",IF(U27=Feiertage!$B$17,\"Pfingst-So.\",IF(U27=Feiertage!$B$18,\"Pfingst-Mo.\",IF(U27=Feiertage!$B$20,\"Fronl.\",\"\"))))","v":""},{"$f":"IF(V27=Feiertage!$B$16,\"Christi HF.\",IF(V27=Feiertage!$B$17,\"Pfingst-So.\",IF(V27=Feiertage!$B$18,\"Pfingst-Mo.\",IF(V27=Feiertage!$B$20,\"Fronl.\",\"\"))))","v":""},{"$f":"IF(W27=Feiertage!$B$16,\"Christi HF.\",IF(W27=Feiertage!$B$17,\"Pfingst-So.\",IF(W27=Feiertage!$B$18,\"Pfingst-Mo.\",IF(W27=Feiertage!$B$20,\"Fronl.\",\"\"))))","v":""},{"$f":"IF(X27=Feiertage!$B$16,\"Christi HF.\",IF(X27=Feiertage!$B$17,\"Pfingst-So.\",IF(X27=Feiertage!$B$18,\"Pfingst-Mo.\",IF(X27=Feiertage!$B$20,\"Fronl.\",\"\"))))","v":""}]
[]
["Juli",{"$f":"B27+30","v":"2014-07-01"},{"$f":"B31+1","v":"2014-07-02"},{"$f":"C31+1","v":"2014-07-03"},"2014-07-04","2014-07-05","2014-07-06","2014-07-07","2014-07-08","2014-07-09","2014-07-10","2014-07-11","2014-07-12","2014-07-13","2014-07-14","2014-07-15","2014-07-16","2014-07-17","2014-07-18","2014-07-19","2014-07-20","2014-07-21","2014-07-22","2014-07-23","2014-07-24","2014-07-25","2014-07-26","2014-07-27","2014-07-28","2014-07-29","2014-07-30","2014-07-31"]
[null,{"$f":"TEXT(WEEKDAY(B31),\"TTT.\")  &\" , KW \"&WEEKNUM(B31)","v":"Di. , KW 27"},{"$f":"TEXT(WEEKDAY(C31),\"TTT.\")  &\" , KW \"&WEEKNUM(C31)","v":"Mi. , KW 27"},"Do. , KW 27","Fr. , KW 27","Sa. , KW 27","So. , KW 28","Mo. , KW 28","Di. , KW 28","Mi. , KW 28","Do. , KW 28","Fr. , KW 28","Sa. , KW 28","So. , KW 29","Mo. , KW 29","Di. , KW 29","Mi. , KW 29","Do. , KW 29","Fr. , KW 29","Sa. , KW 29","So. , KW 30","Mo. , KW 30","Di. , KW 30","Mi. , KW 30","Do. , KW 30","Fr. , KW 30","Sa. , KW 30","So. , KW 31","Mo. , KW 31","Di. , KW 31","Mi. , KW 31","Do. , KW 31"]
[]
[]
["August",{"$f":"B31+31","v":"2014-08-01"},{"$f":"B35+1","v":"2014-08-02"},{"$f":"C35+1","v":"2014-08-03"},"2014-08-04","2014-08-05","2014-08-06","2014-08-07","2014-08-08","2014-08-09","2014-08-10","2014-08-11","2014-08-12","2014-08-13","2014-08-14","2014-08-15","2014-08-16","2014-08-17","2014-08-18","2014-08-19","2014-08-20","2014-08-21","2014-08-22","2014-08-23","2014-08-24","2014-08-25","2014-08-26","2014-08-27","2014-08-28","2014-08-29","2014-08-30","2014-08-31"]
[null,{"$f":"TEXT(WEEKDAY(B35),\"TTT.\")  &\" , KW \"&WEEKNUM(B35)","v":"Fr. , KW 31"},{"$f":"TEXT(WEEKDAY(C35),\"TTT.\")  &\" , KW \"&WEEKNUM(C35)","v":"Sa. , KW 31"},"So. , KW 32","Mo. , KW 32","Di. , KW 32","Mi. , KW 32","Do. , KW 32","Fr. , KW 32","Sa. , KW 32","So. , KW 33","Mo. , KW 33","Di. , KW 33","Mi. , KW 33","Do. , KW 33","Fr. , KW 33","Sa. , KW 33","So. , KW 34","Mo. , KW 34","Di. , KW 34","Mi. , KW 34","Do. , KW 34","Fr. , KW 34","Sa. , KW 34","So. , KW 35","Mo. , KW 35","Di. , KW 35","Mi. , KW 35","Do. , KW 35","Fr. , KW 35","Sa. , KW 35","So. , KW 36"]
[null,null,null,null,null,null,null,null,null,null,null,null,null,null,null,{"$f":"Feiertage!A23","v":"Mariä HF."}]
[]
["September",{"$f":"B35+31","v":"2014-09-01"},{"$f":"B39+1","v":"2014-09-02"},{"$f":"C39+1","v":"2014-09-03"},"2014-09-04","2014-09-05","2014-09-06","2014-09-07","2014-09-08","2014-09-09","2014-09-10","2014-09-11","2014-09-12","2014-09-13","2014-09-14","2014-09-15","2014-09-16","2014-09-17","2014-09-18","2014-09-19","2014-09-20","2014-09-21","2014-09-22","2014-09-23","2014-09-24","2014-09-25","2014-09-26","2014-09-27","2014-09-28","2014-09-29","2014-09-30"]
[null,{"$f":"TEXT(WEEKDAY(B39),\"TTT.\")  &\" , KW \"&WEEKNUM(B39)","v":"Mo. , KW 36"},{"$f":"TEXT(WEEKDAY(C39),\"TTT.\")  &\" , KW \"&WEEKNUM(C39)","v":"Di. , KW 36"},"Mi. , KW 36","Do. , KW 36","Fr. , KW 36","Sa. , KW 36","So. , KW 37","Mo. , KW 37","Di. , KW 37","Mi. , KW 37","Do. , KW 37","Fr. , KW 37","Sa. , KW 37","So. , KW 38","Mo. , KW 38","Di. , KW 38","Mi. , KW 38","Do. , KW 38","Fr. , KW 38","Sa. , KW 38","So. , KW 39","Mo. , KW 39","Di. , KW 39","Mi. , KW 39","Do. , KW 39","Fr. , KW 39","Sa. , KW 39","So. , KW 40","Mo. , KW 40","Di. , KW 40"]
[]
[]
["Oktober",{"$f":"B39+30","v":"2014-10-01"},{"$f":"B43+1","v":"2014-10-02"},{"$f":"C43+1","v":"2014-10-03"},"2014-10-04","2014-10-05","2014-10-06","2014-10-07","2014-10-08","2014-10-09","2014-10-10","2014-10-11","2014-10-12","2014-10-13","2014-10-14","2014-10-15","2014-10-16","2014-10-17","2014-10-18","2014-10-19","2014-10-20","2014-10-21","2014-10-22","2014-10-23","2014-10-24","2014-10-25","2014-10-26","2014-10-27","2014-10-28","2014-10-29","2014-10-30","2014-10-31"]
[null,{"$f":"TEXT(WEEKDAY(B43),\"TTT.\")  &\" , KW \"&WEEKNUM(B43)","v":"Mi. , KW 40"},{"$f":"TEXT(WEEKDAY(C43),\"TTT.\")  &\" , KW \"&WEEKNUM(C43)","v":"Do. , KW 40"},"Fr. , KW 40","Sa. , KW 40","So. , KW 41","Mo. , KW 41","Di. , KW 41","Mi. , KW 41","Do. , KW 41","Fr. , KW 41","Sa. , KW 41","So. , KW 42","Mo. , KW 42","Di. , KW 42","Mi. , KW 42","Do. , KW 42","Fr. , KW 42","Sa. , KW 42","So. , KW 43","Mo. , KW 43","Di. , KW 43","Mi. , KW 43","Do. , KW 43","Fr. , KW 43","Sa. , KW 43","So. , KW 44","Mo. , KW 44","Di. , KW 44","Mi. , KW 44","Do. , KW 44","Fr. , KW 44"]
[null,null,null,{"$f":"Feiertage!A25","v":"T. d. Dt. Einh."},null,null,null,null,null,null,null,null,null,null,null,null,null,null,null,null,null,null,null,null,null,null,null,null,null,null,null,{"$f":"Feiertage!A26","v":"ReformT."}]
[]
["November",{"$f":"B43+31","v":"2014-11-01"},{"$f":"B47+1","v":"2014-11-02"},{"$f":"C47+1","v":"2014-11-03"},"2014-11-04","2014-11-05","2014-11-06","2014-11-07","2014-11-08","2014-11-09","2014-11-10","2014-11-11","2014-11-12","2014-11-13","2014-11-14","2014-11-15","2014-11-16","2014-11-17","2014-11-18","2014-11-19","2014-11-20","2014-11-21","2014-11-22","2014-11-23","2014-11-24","2014-11-25","2014-11-26","2014-11-27","2014-11-28","2014-11-29","2014-11-30"]
[null,{"$f":"TEXT(WEEKDAY(B47),\"TTT.\")  &\" , KW \"&WEEKNUM(B47)","v":"Sa. , KW 44"},{"$f":"TEXT(WEEKDAY(C47),\"TTT.\")  &\" , KW \"&WEEKNUM(C47)","v":"So. , KW 45"},"Mo. , KW 45","Di. , KW 45","Mi. , KW 45","Do. , KW 45","Fr. , KW 45","Sa. , KW 45","So. , KW 46","Mo. , KW 46","Di. , KW 46","Mi. , KW 46","Do. , KW 46","Fr. , KW 46","Sa. , KW 46","So. , KW 47","Mo. , KW 47","Di. , KW 47","Mi. , KW 47","Do. , KW 47","Fr. , KW 47","Sa. , KW 47","So. , KW 48","Mo. , KW 48","Di. , KW 48","Mi. , KW 48","Do. , KW 48","Fr. , KW 48","Sa. , KW 48","So. , KW 49"]
[null,{"$f":"Feiertage!A28","v":"Allerhlg"},{"$f":"Feiertage!A29","v":"Allerseel."},null,null,null,null,{"$f":"IF(H47=Feiertage!$B$31,\"VolkstrT.\",IF(H47=Feiertage!$B$32,\"Buß-BetT.\",IF(H47=Feiertage!$B$33,\"Totenso.\",\"\")))","v":""},{"$f":"IF(I47=Feiertage!$B$31,\"VolkstrT.\",IF(I47=Feiertage!$B$32,\"Buß-BetT.\",IF(I47=Feiertage!$B$33,\"Totenso.\",\"\")))","v":""},{"$f":"IF(J47=Feiertage!$B$31,\"VolkstrT.\",IF(J47=Feiertage!$B$32,\"Buß-BetT.\",IF(J47=Feiertage!$B$33,\"Totenso.\",\"\")))","v":""},{"$f":"IF(K47=Feiertage!$B$31,\"VolkstrT.\",IF(K47=Feiertage!$B$32,\"Buß-BetT.\",IF(K47=Feiertage!$B$33,\"Totenso.\",\"\")))","v":""},{"$f":"IF(L47=Feiertage!$B$31,\"VolkstrT.\",IF(L47=Feiertage!$B$32,\"Buß-BetT.\",IF(L47=Feiertage!$B$33,\"Totenso.\",\"\")))","v":""},{"$f":"IF(M47=Feiertage!$B$31,\"VolkstrT.\",IF(M47=Feiertage!$B$32,\"Buß-BetT.\",IF(M47=Feiertage!$B$33,\"Totenso.\",\"\")))","v":""},{"$f":"IF(N47=Feiertage!$B$31,\"VolkstrT.\",IF(N47=Feiertage!$B$32,\"Buß-BetT.\",IF(N47=Feiertage!$B$33,\"Totenso.\",\"\")))","v":""},{"$f":"IF(O47=Feiertage!$B$31,\"VolkstrT.\",IF(O47=Feiertage!$B$32,\"Buß-BetT.\",IF(O47=Feiertage!$B$33,\"Totenso.\",\"\")))","v":""},{"$f":"IF(P47=Feiertage!$B$31,\"VolkstrT.\",IF(P47=Feiertage!$B$32,\"Buß-BetT.\",IF(P47=Feiertage!$B$33,\"Totenso.\",\"\")))","v":""},{"$f":"IF(Q47=Feiertage!$B$31,\"VolkstrT.\",IF(Q47=Feiertage!$B$32,\"Buß-BetT.\",IF(Q47=Feiertage!$B$33,\"Totenso.\",\"\")))","v":""},{"$f":"IF(R47=Feiertage!$B$31,\"VolkstrT.\",IF(R47=Feiertage!$B$32,\"Buß-BetT.\",IF(R47=Feiertage!$B$33,\"Totenso.\",\"\")))","v":""},{"$f":"IF(S47=Feiertage!$B$31,\"VolkstrT.\",IF(S47=Feiertage!$B$32,\"Buß-BetT.\",IF(S47=Feiertage!$B$33,\"Totenso.\",\"\")))","v":""},{"$f":"IF(T47=Feiertage!$B$31,\"VolkstrT.\",IF(T47=Feiertage!$B$32,\"Buß-BetT.\",IF(T47=Feiertage!$B$33,\"Totenso.\",\"\")))","v":""},{"$f":"IF(U47=Feiertage!$B$31,\"VolkstrT.\",IF(U47=Feiertage!$B$32,\"Buß-BetT.\",IF(U47=Feiertage!$B$33,\"Totenso.\",\"\")))","v":""},{"$f":"IF(V47=Feiertage!$B$31,\"VolkstrT.\",IF(V47=Feiertage!$B$32,\"Buß-BetT.\",IF(V47=Feiertage!$B$33,\"Totenso.\",\"\")))","v":""},{"$f":"IF(W47=Feiertage!$B$31,\"VolkstT.\",IF(W47=Feiertage!$B$32,\"Buß-BetT\",IF(W47=Feiertage!$B$33,\"Totenso.\",(IF(W47=Feiertage!$B$35,\"1. Advent\",\"\")))))","v":""},{"$f":"IF(X47=Feiertage!$B$31,\"VolkstT.\",IF(X47=Feiertage!$B$32,\"Buß-BetT\",IF(X47=Feiertage!$B$33,\"Totenso.\",(IF(X47=Feiertage!$B$35,\"1. Advent\",\"\")))))","v":""},{"$f":"IF(Y47=Feiertage!$B$31,\"VolkstT.\",IF(Y47=Feiertage!$B$32,\"Buß-BetT\",IF(Y47=Feiertage!$B$33,\"Totenso.\",(IF(Y47=Feiertage!$B$35,\"1. Advent\",\"\")))))","v":""},{"$f":"IF(Z47=Feiertage!$B$31,\"VolkstT.\",IF(Z47=Feiertage!$B$32,\"Buß-BetT\",IF(Z47=Feiertage!$B$33,\"Totenso.\",(IF(Z47=Feiertage!$B$35,\"1. Advent\",\"\")))))","v":""},{"$f":"IF(AA47=Feiertage!$B$31,\"VolkstT.\",IF(AA47=Feiertage!$B$32,\"Buß-BetT\",IF(AA47=Feiertage!$B$33,\"Totenso.\",(IF(AA47=Feiertage!$B$35,\"1. Advent\",\"\")))))","v":""},{"$f":"IF(AB47=Feiertage!$B$31,\"VolkstT.\",IF(AB47=Feiertage!$B$32,\"Buß-BetT\",IF(AB47=Feiertage!$B$33,\"Totenso.\",(IF(AB47=Feiertage!$B$35,\"1. Advent\",\"\")))))","v":""},{"$f":"IF(AC47=Feiertage!$B$31,\"VolkstT.\",IF(AC47=Feiertage!$B$32,\"Buß-BetT\",IF(AC47=Feiertage!$B$33,\"Totenso.\",(IF(AC47=Feiertage!$B$35,\"1. Advent\",\"\")))))","v":""},{"$f":"IF(AD47=Feiertage!$B$31,\"VolkstT.\",IF(AD47=Feiertage!$B$32,\"Buß-BetT\",IF(AD47=Feiertage!$B$33,\"Totenso.\",(IF(AD47=Feiertage!$B$35,\"1. Advent\",\"\")))))","v":""},{"$f":"IF(AE47=Feiertage!$B$31,\"VolkstT.\",IF(AE47=Feiertage!$B$32,\"Buß-BetT\",IF(AE47=Feiertage!$B$33,\"Totenso.\",(IF(AE47=Feiertage!$B$35,\"1. Advent\",\"\")))))","v":""}]
[]
["Dezember",{"$f":"B47+30","v":"2014-12-01"},{"$f":"B51+1","v":"2014-12-02"},{"$f":"C51+1","v":"2014-12-03"},"2014-12-04","2014-12-05","2014-12-06","2014-12-07","2014-12-08","2014-12-09","2014-12-10","2014-12-11","2014-12-12","2014-12-13","2014-12-14","2014-12-15","2014-12-16","2014-12-17","2014-12-18","2014-12-19","2014-12-20","2014-12-21","2014-12-22","2014-12-23","2014-12-24","2014-12-25","2014-12-26","2014-12-27","2014-12-28","2014-12-29","2014-12-30","2014-12-31"]
[null,{"$f":"TEXT(WEEKDAY(B51),\"TTT.\")  &\" , KW \"&WEEKNUM(B51)","v":"Mo. , KW 49"},{"$f":"TEXT(WEEKDAY(C51),\"TTT.\")  &\" , KW \"&WEEKNUM(C51)","v":"Di. , KW 49"},"Mi. , KW 49","Do. , KW 49","Fr. , KW 49","Sa. , KW 49","So. , KW 50","Mo. , KW 50","Di. , KW 50","Mi. , KW 50","Do. , KW 50","Fr. , KW 50","Sa. , KW 50","So. , KW 51","Mo. , KW 51","Di. , KW 51","Mi. , KW 51","Do. , KW 51","Fr. , KW 51","Sa. , KW 51","So. , KW 52","Mo. , KW 52","Di. , KW 52","Mi. , KW 52","Do. , KW 52","Fr. , KW 52","Sa. , KW 52","So. , KW 53","Mo. , KW 53","Di. , KW 53","Mi. , KW 53"]
[null,{"$f":"IF(B51=Feiertage!$B$35,\"1. Advent\",IF(B51=Feiertage!$B$36,\"2. Advent\",IF(B51=Feiertage!$B$37,\"3. Advent\",IF(B51=Feiertage!$B$38,\"4. Advent\",\"\"))))","v":""},{"$f":"IF(C51=Feiertage!$B$35,\"1. Advent\",IF(C51=Feiertage!$B$36,\"2. Advent\",IF(C51=Feiertage!$B$37,\"3. Advent\",IF(C51=Feiertage!$B$38,\"4. Advent\",\"\"))))","v":""},{"$f":"IF(D51=Feiertage!$B$35,\"1. Advent\",IF(D51=Feiertage!$B$36,\"2. Advent\",IF(D51=Feiertage!$B$37,\"3. Advent\",IF(D51=Feiertage!$B$38,\"4. Advent\",\"\"))))","v":""},{"$f":"IF(E51=Feiertage!$B$35,\"1. Advent\",IF(E51=Feiertage!$B$36,\"2. Advent\",IF(E51=Feiertage!$B$37,\"3. Advent\",IF(E51=Feiertage!$B$38,\"4. Advent\",\"\"))))","v":""},{"$f":"IF(F51=Feiertage!$B$35,\"1. Advent\",IF(F51=Feiertage!$B$36,\"2. Advent\",IF(F51=Feiertage!$B$37,\"3. Advent\",IF(F51=Feiertage!$B$38,\"4. Advent\",\"\"))))","v":""},{"$f":"IF(G51=Feiertage!$B$35,\"1. Advent\",IF(G51=Feiertage!$B$36,\"2. Advent\",IF(G51=Feiertage!$B$37,\"3. Advent\",IF(G51=Feiertage!$B$38,\"4. Advent\",\"\"))))","v":""},{"$f":"IF(H51=Feiertage!$B$35,\"1. Advent\",IF(H51=Feiertage!$B$36,\"2. Advent\",IF(H51=Feiertage!$B$37,\"3. Advent\",IF(H51=Feiertage!$B$38,\"4. Advent\",\"\"))))","v":""},{"$f":"IF(I51=Feiertage!$B$35,\"1. Advent\",IF(I51=Feiertage!$B$36,\"2. Advent\",IF(I51=Feiertage!$B$37,\"3. Advent\",IF(I51=Feiertage!$B$38,\"4. Advent\",\"\"))))","v":""},{"$f":"IF(J51=Feiertage!$B$35,\"1. Advent\",IF(J51=Feiertage!$B$36,\"2. Advent\",IF(J51=Feiertage!$B$37,\"3. Advent\",IF(J51=Feiertage!$B$38,\"4. Advent\",\"\"))))","v":""},{"$f":"IF(K51=Feiertage!$B$35,\"1. Advent\",IF(K51=Feiertage!$B$36,\"2. Advent\",IF(K51=Feiertage!$B$37,\"3. Advent\",IF(K51=Feiertage!$B$38,\"4. Advent\",\"\"))))","v":""},{"$f":"IF(L51=Feiertage!$B$35,\"1. Advent\",IF(L51=Feiertage!$B$36,\"2. Advent\",IF(L51=Feiertage!$B$37,\"3. Advent\",IF(L51=Feiertage!$B$38,\"4. Advent\",\"\"))))","v":""},{"$f":"IF(M51=Feiertage!$B$35,\"1. Advent\",IF(M51=Feiertage!$B$36,\"2. Advent\",IF(M51=Feiertage!$B$37,\"3. Advent\",IF(M51=Feiertage!$B$38,\"4. Advent\",\"\"))))","v":""},{"$f":"IF(N51=Feiertage!$B$35,\"1. Advent\",IF(N51=Feiertage!$B$36,\"2. Advent\",IF(N51=Feiertage!$B$37,\"3. Advent\",IF(N51=Feiertage!$B$38,\"4. Advent\",\"\"))))","v":""},{"$f":"IF(O51=Feiertage!$B$35,\"1. Advent\",IF(O51=Feiertage!$B$36,\"2. Advent\",IF(O51=Feiertage!$B$37,\"3. Advent\",IF(O51=Feiertage!$B$38,\"4. Advent\",\"\"))))","v":""},{"$f":"IF(P51=Feiertage!$B$35,\"1. Advent\",IF(P51=Feiertage!$B$36,\"2. Advent\",IF(P51=Feiertage!$B$37,\"3. Advent\",IF(P51=Feiertage!$B$38,\"4. Advent\",\"\"))))","v":""},{"$f":"IF(Q51=Feiertage!$B$35,\"1. Advent\",IF(Q51=Feiertage!$B$36,\"2. Advent\",IF(Q51=Feiertage!$B$37,\"3. Advent\",IF(Q51=Feiertage!$B$38,\"4. Advent\",\"\"))))","v":""},{"$f":"IF(R51=Feiertage!$B$35,\"1. Advent\",IF(R51=Feiertage!$B$36,\"2. Advent\",IF(R51=Feiertage!$B$37,\"3. Advent\",IF(R51=Feiertage!$B$38,\"4. Advent\",\"\"))))","v":""},{"$f":"IF(S51=Feiertage!$B$35,\"1. Advent\",IF(S51=Feiertage!$B$36,\"2. Advent\",IF(S51=Feiertage!$B$37,\"3. Advent\",IF(S51=Feiertage!$B$38,\"4. Advent\",\"\"))))","v":""},{"$f":"IF(T51=Feiertage!$B$35,\"1. Advent\",IF(T51=Feiertage!$B$36,\"2. Advent\",IF(T51=Feiertage!$B$37,\"3. Advent\",IF(T51=Feiertage!$B$38,\"4. Advent\",\"\"))))","v":""},{"$f":"IF(U51=Feiertage!$B$35,\"1. Advent\",IF(U51=Feiertage!$B$36,\"2. Advent\",IF(U51=Feiertage!$B$37,\"3. Advent\",IF(U51=Feiertage!$B$38,\"4. Advent\",\"\"))))","v":""},{"$f":"IF(V51=Feiertage!$B$35,\"1. Advent\",IF(V51=Feiertage!$B$36,\"2. Advent\",IF(V51=Feiertage!$B$37,\"3. Advent\",IF(V51=Feiertage!$B$38,\"4. Advent\",\"\"))))","v":""},{"$f":"IF(W51=Feiertage!$B$35,\"1. Advent\",IF(W51=Feiertage!$B$36,\"2. Advent\",IF(W51=Feiertage!$B$37,\"3. Advent\",IF(W51=Feiertage!$B$38,\"4. Advent\",\"\"))))","v":""},{"$f":"IF(X51=Feiertage!$B$35,\"1. Advent\",IF(X51=Feiertage!$B$36,\"2. Advent\",IF(X51=Feiertage!$B$37,\"3. Advent\",IF(X51=Feiertage!$B$38,\"4. Advent\",\"\"))))","v":""},{"$f":"IF(Y51=Feiertage!$B$38,\"4.Ad+Hl.A.\",Feiertage!A39)","v":"Hl. Abend"},{"$f":"Feiertage!A40","v":"1. Weihn. T."},{"$f":"Feiertage!A41","v":"2. Weihn. T."},null,null,null,null,{"$f":"Feiertage!A42","v":"Silvester"}]
[]
[]
[]
[]
[]
[]
[]
[]
[]
[]
[]
[]
[]
[]
[]
[]
[]
[null,null,null,null,null,null,2003]

{"sheet":"Feiertage","index":3,"n_rows":49,"n_cols":11,"rows_kept":49,"cut":false,"hidden":false,"merged":[[19,10,24,15]]}
[{"$f":"'Kalender-Laengs'!A1","v":"2019-01-01"},null,null,null,null,null,null,"2015-01-01"]
["Neujahr",{"$f":"DATE(YEAR(A1),1,1)","v":"2019-01-01"},{"$f":"TEXT(WEEKDAY(B2,1),\"TTT\")","v":"Di"},null,null,null,null,{"$f":"YEAR(H1)","v":2015}]
["Hl. 3 Könige",{"$f":"DATE(YEAR(A1),1,6)","v":"2019-01-06"},{"$f":"TEXT(WEEKDAY(B3,1),\"TTT\")","v":"So"},null,null,null,null,{"$f":"7*ROUND((4&-YEAR(H1))/7+MOD(19*MOD(YEAR(H1),19)-7,30)*0.14,)-6","v":"2015-04-05"}," =7*RUNDEN((4&-JAHR(H1))/7+REST(19*REST(JAHR(H1);19)-7;30)*0,14;)-6"]
[]
["Maria Lichtm. D.Her",{"$f":"DATE(YEAR(A1),2,2)","v":"2019-02-02"},{"$f":"TEXT(WEEKDAY(B5,1),\"TTT\")","v":"Sa"},null,null,null,null,null,"Maria Lichtmess oder Darstellung des Herren beendet Weihnachten  -> Krippe abbauen, Weihnachtsbaum abbauen"]
[]
["Altweiberf.",{"$f":"B12-52","v":"2019-02-28"},{"$f":"TEXT(WEEKDAY(B7,1),\"TTT\")","v":"Do"}]
["Rosenmontag",{"$f":"B12-48","v":"2019-03-04"},{"$f":"TEXT(WEEKDAY(B8,1),\"TTT\")","v":"Mo"}]
[]
[{"$f":"\"Kar-\" & TEXT(WEEKDAY(B10),\"TTTT\")","v":"Kar-Freitag"},{"$f":"B12-2","v":"2019-04-19"},{"$f":"TEXT(WEEKDAY(B10,1),\"TTT\")","v":"Fr"}]
["Oster-Samstag",{"$f":"B12-1","v":"2019-04-20"},{"$f":"TEXT(WEEKDAY(B11,1),\"TTT\")","v":"Sa"}]
[{"$f":"\"Oster-\" & TEXT(WEEKDAY(B12),\"TTTT\")","v":"Oster-Sonntag"},{"$f":"7*ROUND((4&-YEAR(A1))/7+MOD(19*MOD(YEAR(A1),19)-7,30)*0.14,)-6","v":"2019-04-21"},{"$f":"TEXT(WEEKDAY(B12,1),\"TTT\")","v":"So"},"Bezugszeile",null,null,null," =7*RUNDEN((4&-JAHR(A1))/7+REST(19*REST(JAHR(A1);19)-7;30)*0,14;)-6"]
[{"$f":"\"Oster-\" & TEXT(WEEKDAY(B13),\"TTTT\")","v":"Oster-Montag"},{"$f":"B12+1","v":"2019-04-22"},{"$f":"TEXT(WEEKDAY(B13,1),\"TTT\")","v":"Mo"}]
[]
["Maifeiertag",{"$f":"DATE(YEAR($A$1),5,1)","v":"2019-05-01"},{"$f":"TEXT(WEEKDAY(B15,1),\"TTT\")","v":"Mi"}]
["Christi Himmelf.",{"$f":"B12+39","v":"2019-05-30"},{"$f":"TEXT(WEEKDAY(B16,1),\"TTT\")","v":"Do"},null,null,null,null,"    Alternativformel   =(DM((TAG(MINUTE($E$1/38)/2+55)&\".4.\"&$E$1)/7;)*7-6)"]
[{"$f":"\"Pfingst-\" & TEXT(WEEKDAY(B17),\"TTTT\")","v":"Pfingst-Sonntag"},{"$f":"B12+49","v":"2019-06-09"},{"$f":"TEXT(WEEKDAY(B17,1),\"TTT\")","v":"So"}]
[{"$f":"\"Pfingst-\" & TEXT(WEEKDAY(B18),\"TTTT\")","v":"Pfingst-Montag"},{"$f":"B12+50","v":"2019-06-10"},{"$f":"TEXT(WEEKDAY(B18,1),\"TTT\")","v":"Mo"}]
[]
["Fronleichnam",{"$f":"B12+60","v":"2019-06-20"},{"$f":"TEXT(WEEKDAY(B20,1),\"TTT\")","v":"Do"},null,null,null,null,"=H4-52 Altweiber",null,null,"Ostern fällt immer zwischen den 22. März und dem 25. April. Ausschlaggebend ist hier der erste Sonntag nach dem ersten Vollmond nach Frühlingsanfang. An diesem Sonntag feiern wir das Osterfest. Der große deutsche Mathematiker Gauß hat dazu eine Berechnungsformel im 19. Jahrhundert entwickelt, die in der von uns hier eingesetzten ihren Niederschlag gefunden hat."]
[]
["Friedensfest",{"$f":"DATE(YEAR($A$1),8,8)","v":"2019-08-08"},{"$f":"TEXT(WEEKDAY(B22,1),\"TTT\")","v":"Do"},null,null,null,null,"=H4-48 Rosenmontag"]
["Mariä HF.",{"$f":"DATE(YEAR($A$1),8,15)","v":"2019-08-15"},{"$f":"TEXT(WEEKDAY(B23,1),\"TTT\")","v":"Do"},null,null,null,null,"=H4-2 Karfreitag"]
[]
["T. d. Dt. Einh.",{"$f":"DATE(YEAR($A$1),10,3)","v":"2019-10-03"},{"$f":"TEXT(WEEKDAY(B25,1),\"TTT\")","v":"Do"},null,null,null,null,"=H4+1 Ostermontag"]
["ReformT.",{"$f":"DATE(YEAR($A$1),10,31)","v":"2019-10-31"},{"$f":"TEXT(WEEKDAY(B26,1),\"TTT\")","v":"Do"},null,null,null,null,"=H4+39 Himmelfahrt"]
[]
["Allerhlg",{"$f":"DATE(YEAR($A$1),11,1)","v":"2019-11-01"},{"$f":"TEXT(WEEKDAY(B28,1),\"TTT\")","v":"Fr"},null,null,null,null,"=H4+49 Pfingstsonntag"]
["Allerseel.",{"$f":"DATE(YEAR($A$1),11,2)","v":"2019-11-02"},{"$f":"TEXT(WEEKDAY(B29,1),\"TTT\")","v":"Sa"},null,null,null,null,"=H4+50 Pfingstmontag"]
[null,null,null,null,null,null,null,"=H4+60 happy cadaver"]
["Volkstrauertag",{"$f":"$B$35-14","v":"2019-11-17"},{"$f":"TEXT(WEEKDAY(B31,1),\"TTT\")","v":"So"}]
["Buß- u. Bettag",{"$f":"$B$35-11","v":"2019-11-20"},{"$f":"TEXT(WEEKDAY(B32,1),\"TTT\")","v":"Mi"}]
["Totensontag",{"$f":"$B$35-7","v":"2019-11-24"},{"$f":"TEXT(WEEKDAY(B33,1),\"TTT\")","v":"So"}]
[]
[{"$f":" \"1. Advent \" & TEXT(WEEKDAY(B35), \"TTT\")","v":"1. Advent So"},{"$f":"DATE(YEAR($A$1),12,25)-WEEKDAY(DATE(YEAR($A$1),12,25),2)-21","v":"2019-12-01"},{"$f":"TEXT(WEEKDAY(B35,1),\"TTT\")","v":"So"},"Bezugszeile",null,null,null," =DATUM(JAHR($A$1);12;25)-WOCHENTAG(DATUM(JAHR($A$1);12;25);2)-21"]
[{"$f":" \"2. Advent \" & TEXT(WEEKDAY(B36), \"TTT\")","v":"2. Advent So"},{"$f":"DATE(YEAR($A$1),12,25)-WEEKDAY(DATE(YEAR($A$1),12,25),2)-14","v":"2019-12-08"},{"$f":"TEXT(WEEKDAY(B36,1),\"TTT\")","v":"So"}]
[{"$f":" \"3. Advent \" & TEXT(WEEKDAY(B37), \"TTT\")","v":"3. Advent So"},{"$f":"DATE(YEAR($A$1),12,25)-WEEKDAY(DATE(YEAR($A$1),12,25),2)-7","v":"2019-12-15"},{"$f":"TEXT(WEEKDAY(B37,1),\"TTT\")","v":"So"}]
[{"$f":" \"4. Advent \" & TEXT(WEEKDAY(B38), \"TTT\")","v":"4. Advent So"},{"$f":"DATE(YEAR($A$1),12,25)-WEEKDAY(DATE(YEAR($A$1),12,25),2)-0","v":"2019-12-22"},"So"]
["Hl. Abend",{"$f":"DATE(YEAR($A$1),12,24)","v":"2019-12-24"},"Di"]
["1. Weihn. T.",{"$f":"DATE(YEAR($A$1),12,25)","v":"2019-12-25"},"Mi"]
["2. Weihn. T.",{"$f":"DATE(YEAR($A$1),12,26)","v":"2019-12-26"},"Do"]
["Silvester",{"$f":"DATE(YEAR($A$1),12,31)","v":"2019-12-31"},"Di"]
[]
[]
[null,null,null,null,null,null,null,{"$f":"\"Heute:  \" & TEXT(TODAY(),\"TT.MM.JJJJ\")","v":"Heute:  25.10.2019"},null," =\"Heute:  \" & TEXT(HEUTE();\"TT.MM.JJJJ\")"]
[]
[]
[]
[null,null,null,null,null,null,null,"Drehfeld für Jahreszahl  Zellverknüpfung mit $B$1  um Jahreszahlen hochzuzählen"]

{"sheet":"Ferienkalender - Feiertage","index":4,"n_rows":14,"n_cols":5,"rows_kept":14,"cut":false,"hidden":false,"merged":[]}
[]
[]
[]
[]
[]
[]
[null,null,"Schulen",null,"http://www.kmk.org/ferienkalender.html"]
[]
[null,null,null,null,"http://www.bildungsserver.de/Ferienkalender-280.html"]
[]
[]
[]
[]
[null,null,"Feiertage",null,"http://www.bmi.bund.de/SharedDocs/Downloads/DE/Lexikon/feiertage_de.html"]

{"sheet":"VBA","index":5,"n_rows":9,"n_cols":2,"rows_kept":9,"cut":false,"hidden":false,"merged":[]}
[]
[]
[]
[null,"Drehfeld für Jahreszahl"]
[]
[null,"Entwurfsmodus"]
[null,"Element anklicken"]
[null,"Kontextmenü"]
[null,"\"Steuerelement formatieren\""]